{"text_format":"1","workbook":"xlsx","n_sheets":9,"sheets":["×例示16①","使用上の留意点 ","様式","start","1","2","end","総括表","リスト"],"not_rendered":{"charts":0,"images":0,"macros":1,"external_links":0,"defined_names":11,"comments":4,"pivot_tables":0},"unopened":[],"bounds":{"document_bytes":16777216,"sheet_cells":100000,"rows_first":2000,"rows_last":500,"rows_between":2000,"halvings":0,"cell_chars":16384,"cell_head_chars":4096},"cells_cut":0,"cells_raw":0,"read":"whole","date_system":"1900"}

{"sheet":"×例示16①","index":0,"n_rows":74,"n_cols":29,"rows_kept":74,"cut":false,"hidden":true,"merged":[[32,0,33,10],[32,12,33,15],[33,17,33,21],[33,22,33,26],[2,8,2,9],[2,12,2,14],[11,21,11,25],[5,18,5,26],[5,12,5,17],[26,0,29,0],[26,1,29,5],[28,9,28,11],[29,9,29,11],[7,21,7,25],[13,21,13,25],[25,0,25,5],[25,6,25,11],[25,12,25,17],[25,18,25,26],[8,9,8,11],[11,9,11,11],[39,11,39,16],[36,22,36,26],[37,13,37,15],[37,18,37,20],[46,22,46,26],[45,22,45,26],[37,23,37,25],[36,17,36,21],[40,11,40,16],[41,22,41,26],[42,22,42,26],[40,17,40,21],[42,17,42,21],[41,11,41,16],[39,22,39,26],[40,22,40,26],[41,17,41,21],[44,22,44,26],[36,11,36,16],[44,11,44,16],[44,17,44,21],[46,7,46,9],[46,11,46,16],[46,17,46,21],[45,17,45,21],[52,11,52,16],[43,11,43,16],[42,11,42,16],[45,11,45,16],[44,5,44,9],[43,5,43,9],[49,23,49,25],[47,22,47,26],[47,17,47,21],[49,18,49,20],[48,17,48,21],[48,22,48,26],[53,5,53,9],[53,11,53,16],[53,22,53,26],[50,17,50,21],[50,22,50,26],[47,7,47,9],[47,11,47,16],[51,1,55,1],[51,4,52,8],[51,10,52,10],[54,7,54,9],[55,7,55,9],[52,17,52,21],[52,22,52,26],[57,10,58,10],[57,11,58,16],[53,17,53,21],[57,17,58,21],[54,11,54,16],[56,11,56,16],[55,22,55,26],[55,11,55,16],[56,17,56,21],[56,22,56,26],[0,0,0,27],[38,22,38,26],[38,18,38,20],[2,0,2,2],[2,3,2,7],[2,15,2,25],[15,0,22,0],[5,0,5,5],[6,0,14,0],[5,6,5,11],[34,1,35,7],[34,8,35,9],[34,10,35,10],[38,10,39,10],[34,17,35,21],[34,22,35,26],[14,9,14,11],[17,9,17,11],[34,11,35,16],[20,9,20,11],[17,21,17,25],[22,21,22,25],[29,21,29,25],[2,26,2,27],[43,17,43,21],[43,22,43,26],[38,11,38,16],[39,17,39,21],[38,1,46,1],[38,4,39,8],[60,12,60,14],[51,11,51,16],[50,4,50,6],[48,8,48,9],[48,11,48,16],[49,13,49,15],[50,11,50,16],[57,1,58,7],[57,8,58,9],[56,8,56,9],[60,24,60,25],[60,18,60,21],[51,18,51,20],[51,22,51,26],[57,22,58,26],[54,17,54,21],[54,22,54,26],[55,17,55,21]]}
["起債対象外事業費等に関する確認調書"]
[]
["団体名",null,null,null,null,null,null,null,"平成",null,27,"年度","事業名"]
[]
["１-１．起債対象外事業費に係る確認態勢等について"]
["確認項目",null,null,null,null,null,"作成者",null,null,null,null,null,"検証者",null,null,null,null,null,"検証資料"]
["貸付対象事業費","実施事業費の確定",null,null,null,null,"    事業課の担当者",null,null,null,null,null,"    事業課",null,null,null,null,null,"    契約書"]
[null,null,null,null,null,null,"    財政担当課の担当者",null,null,null,null,null,"    財政担当課",null,null,null,null,null,"    その他（",null,null,null,null,null,null,null,")"]
[null,null,null,null,null,null,"    その他（",null,null,")"]
[null,"対象事業費の算出",null,null,null,null,"    事業課の担当者",null,null,null,null,null,"    事業課",null,null,null,null,null,"    実施設計書"]
[null,"　対象外事業費の有無",null,null,null,null,"    財政担当課の担当者",null,null,null,null,null,"    財政担当課",null,null,null,null,null,"    対象外事業費リスト"]
[null,"　　  有　　  無",null,null,null,null,"    その他（",null,null,")",null,null,null,null,null,null,null,null,"    その他（",null,null,null,null,null,null,null,")"]
[null,"決算済事業費",null,null,null,null,"    事業課の担当者",null,null,null,null,null,"    事業課",null,null,null,null,null,"    決算書"]
[null,null,null,null,null,null,"    財政担当課の担当者",null,null,null,null,null,"    財政担当課",null,null,null,null,null,"    その他（",null,null,null,null,null,null,null,")"]
[null,null,null,null,null,null,"    その他（",null,null,")"]
["控除財源等","補助金等",null,null,null,null,"    事業課の担当者",null,null,null,null,null,"    事業課",null,null,null,null,null,"    補助事業等実績報告書"]
[null,null,null,null,null,null,"    財政担当課の担当者",null,null,null,null,null,"    財政担当課",null,null,null,null,null,"    都道府県支出金の収納関係書類"]
[null,null,null,null,null,null,"    その他（",null,null,")",null,null,null,null,null,null,null,null,"    その他（",null,null,null,null,null,null,null,")"]
[null,"寄付金・負担金・",null,null,null,null,"    事業課の担当者",null,null,null,null,null,"    事業課",null,null,null,null,null,"    分担金等徴収簿"]
[null,"分担金等",null,null,null,null,"    財政担当課の担当者",null,null,null,null,null,"    財政担当課",null,null,null,null,null,"    寄付金採納簿"]
[null,null,null,null,null,null,"    その他（",null,null,")",null,null,null,null,null,null,null,null,"    保険金等の収納関係書類"]
[null,null,null,null,null,null,null,null,null,null,null,null,null,null,null,null,null,null,"    基金台帳"]
[null,null,null,null,null,null,null,null,null,null,null,null,null,null,null,null,null,null,"    その他（",null,null,null,null,null,null,null,")"]
[]
["１-２．財政融資資金の貸付停止対象財産の区分に係る確認態勢等について"]
["確認項目",null,null,null,null,null,"作成者",null,null,null,null,null,"検証者",null,null,null,null,null,"検証資料"]
["貸付対象事業費","補償金免除繰上償還にかかる貸付停止対象財産の区分（混入がない）",null,null,null,null,"    事業課の担当者",null,null,null,null,null,"    事業課",null,null,null,null,null,"    財政健全化計画等の承認申請時に"]
[null,null,null,null,null,null,"    財政担当課の担当者",null,null,null,null,null,"    財政担当課",null,null,null,null,null,"    提出した９号書式「繰上償還対象事業"]
[null,null,null,null,null,null,"    その他（",null,null,")",null,null,null,null,null,null,null,null,"　　の区分にかかる報告」"]
[null,null,null,null,null,null,null,null,null,null,null,null,null,null,null,null,null,null,"    その他（",null,null,"補償金免除繰上償還を行っていない",null,null,null,null,")"]
[]
["２．上記１．で「対象外事業費有」にチェックした場合のみ、以下に記入して下さい。",null,null,null,null,null,null,null,null,null,null,null,null,null,null,null,null,null,null,null,null,null,null,null,null,null,"（単位：千円）"]
[null,null,null,null,null,null,null,null,null,null,null,null,"実施事業費"]
[null,null,null,null,null,null,null,null,null,null,null,null,null,null,null,null,null,"うち補助対象事業費",null,null,null,null,"うち単独事業費"]
[null,"実施事業費計",null,null,null,null,null,null,"(B+O)",null,"Ａ",{"$f":"R35+W35","v":0},null,null,null,null,null,{"$f":"R37+R51","v":0},null,null,null,null,{"$f":"W37+W51","v":0}]
[]
[null,null,null,null,"実施事業費",null,null,null,null,null,"Ｂ",{"$f":"R37+W37","v":0}]
[null,null,null,null,null,"（うち事務費）",null,null,null,null,"Ｃ",null,"（",{"$f":"S38+X38","v":0},null,null,"）","（",null,null,null,"）","（",null,null,null,"）"]
[null,"施設分",null,null,"起債対象外事業費",null,null,null,null,null,"Ｄ",null,null,null,null,null,null,"【",null,null,null,"】"]
[null,null,null,null,null,null,null,null,null,null,null,{"$f":"SUM(R40:AA40)","v":0},null,null,null,null,null,{"$f":"SUM(R41:V48)","v":0},null,null,null,null,{"$f":"SUM(W41:AA48)","v":0}]
[null,null,null,null,null,"一般的調査費",null,null,null,null,"Ｅ",{"$f":"R41+W41","v":0}]
[null,null,null,null,null,"維持管理費",null,null,null,null,"Ｆ",0]
[null,null,null,null,null,"解体撤去費等",null,null,null,null,"Ｇ",0]
[null,null,null,null,null,"備品等",null,null,null,null,"Ｈ",0]
[null,null,null,null,null,"消火栓等",null,null,null,null,"Ｉ",0]
[null,null,null,null,null,"事務費等対象外分",null,null,null,null,"Ｊ",0]
[null,null,null,null,null,"その他（",null,")",null,null,"Ｋ",0]
[null,null,null,null,null,"その他（",null,")",null,null,"Ｌ",0]
[null,null,null,null,"起債対象事業費 ",null,null,null,"(B-D)",null,"Ｍ",{"$f":"L37-L40","v":0},null,null,null,null,null,{"$f":"R37-R40","v":0},null,null,null,null,{"$f":"W37-W40","v":0}]
[null,null,null,null,null,"（うち事務費）",null,null,null,null,"Ｎ",null,"（",{"$f":"S50+X50","v":0},null,null,"）","（",{"$f":"IF(AND(S38=\"\",R46=\"\"),0,S38-R46)","v":0},null,null,"）","（",{"$f":"IF(AND(X38=\"\",W46=\"\"),0,X38-W46)","v":0},null,null,"）",null,{"$f":"IF(X50<0,\"←エラー！単独事務費がマイナス\",\"\")","v":""}]
[null,null,null,null,"実施事業費",null,null,null,null,null,"Ｏ",{"$f":"R51+W51","v":0}]
[null,"用地分",null,null,"起債対象外事業費",null,null,null,null,null,"Ｐ",null,null,null,null,null,null,"【",null,null,null,"】"]
[null,null,null,null,null,null,null,null,null,null,null,{"$f":"SUM(R53:AA53)","v":0},null,null,null,null,null,{"$f":"SUM(R54:V56)","v":0},null,null,null,null,{"$f":"SUM(W54:AA56)","v":0}]
[null,null,null,null,null,"事業区域外用地",null,null,null,null,null,{"$f":"R54+W54","v":0}]
[null,null,null,null,null,"その他（",null,")",null,null,null,{"$f":"R55+W55","v":0}]
[null,null,null,null,null,"その他（",null,")",null,null,null,{"$f":"R56+W56","v":0}]
[null,null,null,null,"起債対象事業費",null,null,null,"(O-P)",null,"Ｑ",{"$f":"L51-L53","v":0},null,null,null,null,null,{"$f":"R51-R53","v":0},null,null,null,null,{"$f":"W51-W53","v":0}]
[null,"起債対象事業費計",null,null,null,null,null,null,"(M+Q)",null,"Ｒ",{"$f":"L49+L57","v":0},null,null,null,null,null,{"$f":"R49+R57","v":0},null,null,null,null,{"$f":"W49+W57","v":0}]
[]
[null,null,null,null,null,null,null,null,null,null,null,null,"単独事業事務費（Ｎ）",null,null,null,null,"　起債対象事業費（Ｍ－Ｎ）",null,null,null,null,null,null,"算入率"]
[null,"単独事業に係る事務費計算（割戻し・自動計算）",null,null,null,null,null,null,null,null,null,"（",{"$f":"IF(X50=\"\",\"\",$X$50)","v":0},null,null,"）","÷","（",{"$f":"IF(X50=\"\",\"\",W49-X50)","v":0},null,null,null,"）","＝",{"$f":"IF(M61=0,\"\",M61/S61*100)","v":""},null,"％"]
[]
[]
[]
[null,"注",null,null,"１．【　　】内には、起債対象外事業費に対応する国・都道府県補助金の額を記入する。"]
[null,null,null,null,"２．「一般的調査費」には基本設計、補助金の交付申請事務委託、地元調整、道路使用協議等も含む。"]
[null,null,null,null,"３．「備品等」とは対象外備品及び消耗品をいう。「対象外備品等」とは、原則として１品あたりの取得原"]
[null,null,null,null,null,"価が２０万円未満、又は耐用年数が５年未満であるものをいう。"]
[null,null,null,null,"４．用地分には、造成費、補償費、用地の取得に直接必要とする諸経費等を含む。"]
[null,null,null,null,"５．起債前貸の場合は、添付不要"]
[null,null,null,null,"６．臨時財政対策債の借入の場合は、添付不要"]
[]
[]
[null,"※全ての長期資金借入れについて提出が必要です。（臨時財政対策債のみ提出不要）"]

{"sheet":"使用上の留意点 ","index":1,"n_rows":19,"n_cols":2,"rows_kept":19,"cut":false,"hidden":false,"merged":[[0,0,1,9],[13,1,17,8],[18,1,26,8],[3,1,9,8],[10,1,12,8]]}
["使用上の留意点"]
[]
[]
[null,"　本エクセルシートは、事業実施状況等調書にかかる総括表を作成するためのシートです（1件の借入申込みに対し複数の事業（起債計画書ベース）を含む場合、事業ごとに別葉とし、総括表を作成してください）。総括表には、財政融資資金貸付予定額（変更）通知書に記載されている事業名を記入し、別葉として作成した調書には起債計画書の事業名など具体的な事業名を記入してください。\n　また、本エクセルシートを使用する場合においても、合計金額を含む各金額等については、必ず、再検証願います。なお、必ずしも、本エクセルシートを使用して「事業実施状況等調書」を作成していただく必要はありません。"]
[]
[]
[]
[]
[]
[]
[null,"１．入力方法等\n・最終のタブに「総括表」を設けていますので、必要に応じご使用下さい。\n 「総括表」の各金額欄には、「start」タブと「end」タブの間にあるシートの同位置にあるセルに入力されている金額を単純合計した金額が、自動的に反映されます。\n　（注）同位置にあるセルに異なる事業費内訳などの金額を入力している場合においても、単純合計されますのでご注意下さい。"]
[]
[]
[null,"２．エラーチェックの見方\n・エラーとなる場合、57行目「ok」→「ng」となります。\n 事業費内訳（計）　≠　財源内訳（計）　など、数字が一致しない場合がエラー表示となりますので、例示集を参考に適宜修正してください\n"]
[]
[]
[]
[]
[null,"３．その他留意事項\n・「start」及び「end」タブのシートは、削除しないで下さい。\n・シートを追加する場合には、「start」タブと「end」タブの間に挿入して下さい。\n・「行」・「列」の挿入・削除は行わないで下さい。\n"]

{"sheet":"様式","index":2,"n_rows":57,"n_cols":41,"rows_kept":57,"cut":false,"hidden":false,"merged":[[0,28,0,37],[1,4,1,32],[1,33,1,37],[3,0,3,1],[3,2,3,21],[3,22,3,25],[3,28,3,29],[3,30,3,31],[3,32,3,33],[3,34,3,35],[4,0,4,1],[4,2,4,21],[4,22,4,29],[4,30,4,37],[5,0,8,1],[5,2,8,21],[5,22,8,29],[5,30,8,37],[9,0,10,3],[9,4,10,7],[9,8,9,25],[9,26,9,37],[10,8,10,10],[10,11,10,13],[10,14,10,17],[10,18,10,21],[10,22,10,25],[10,26,10,29],[10,30,10,31],[10,32,10,33],[10,34,10,35],[10,36,10,37],[11,34,11,37],[12,0,12,3],[12,4,12,7],[12,8,12,10],[12,11,12,13],[12,14,12,17],[12,18,12,21],[12,22,12,25],[12,26,12,29],[12,30,12,33],[12,34,12,37],[11,0,11,3],[11,4,11,7],[11,8,11,10],[11,11,11,13],[11,14,11,17],[11,18,11,21],[11,22,11,25],[11,26,11,29],[11,30,11,33],[13,34,13,37],[14,0,14,3],[14,4,14,7],[14,8,14,10],[14,11,14,13],[14,14,14,17],[14,18,14,21],[14,22,14,25],[14,26,14,29],[14,30,14,33],[14,34,14,37],[13,0,13,3],[13,4,13,7],[13,8,13,10],[13,11,13,13],[13,14,13,17],[13,18,13,21],[13,22,13,25],[13,26,13,29],[13,30,13,33],[15,34,15,37],[16,0,16,6],[16,8,16,10],[16,11,16,13],[16,14,16,17],[16,18,16,21],[16,22,16,25],[16,26,16,29],[16,30,16,33],[16,34,16,37],[15,0,15,3],[15,4,15,7],[15,8,15,10],[15,11,15,13],[15,14,15,17],[15,18,15,21],[15,22,15,25],[15,26,15,29],[15,30,15,33],[17,0,17,7],[17,8,17,25],[17,26,17,37],[18,0,18,2],[18,3,18,7],[18,8,18,10],[18,11,18,13],[18,14,18,17],[18,18,18,21],[18,22,18,25],[18,26,18,29],[18,30,18,31],[18,32,18,33],[18,34,18,35],[18,36,18,37],[19,0,22,0],[19,1,19,2],[19,3,19,6],[19,8,19,10],[19,11,19,13],[19,14,19,17],[19,18,19,21],[19,22,19,25],[19,26,19,29],[21,1,21,2],[21,3,21,6],[21,8,21,10],[21,11,21,13],[21,14,21,17],[21,18,21,21],[21,22,21,25],[21,26,21,29],[19,30,19,33],[19,34,19,37],[20,1,20,2],[20,3,20,6],[20,8,20,10],[20,11,20,13],[20,14,20,17],[20,18,20,21],[20,22,20,25],[20,26,20,29],[20,30,20,33],[20,34,20,37],[21,30,21,33],[21,34,21,37],[22,1,22,2],[22,3,22,6],[22,8,22,10],[22,11,22,13],[22,14,22,17],[22,18,22,21],[22,22,22,25],[22,26,22,29],[22,30,22,33],[22,34,22,37],[23,30,23,33],[23,34,23,37],[24,3,24,6],[24,8,24,10],[24,11,24,13],[24,14,24,17],[24,18,24,21],[24,22,24,25],[24,26,24,29],[24,30,24,33],[24,34,24,37],[23,3,23,6],[23,8,23,10],[23,11,23,13],[23,14,23,17],[23,18,23,21],[23,22,23,25],[23,26,23,29],[25,30,25,33],[25,34,25,37],[26,0,26,2],[26,3,26,7],[26,8,26,10],[26,11,26,13],[26,14,26,17],[26,18,26,21],[26,22,26,25],[26,26,26,29],[26,30,26,33],[26,34,26,37],[23,0,25,0],[23,1,24,2],[25,1,25,2],[25,3,25,6],[25,8,25,10],[25,11,25,13],[25,14,25,17],[25,18,25,21],[25,22,25,25],[25,26,25,29],[27,34,27,37],[28,0,28,2],[28,3,28,7],[28,8,28,10],[28,11,28,13],[28,14,28,17],[28,18,28,21],[28,22,28,25],[28,26,28,29],[28,30,28,33],[28,34,28,37],[27,0,27,2],[27,3,27,7],[27,8,27,10],[27,11,27,13],[27,14,27,17],[27,18,27,21],[27,22,27,25],[27,26,27,29],[27,30,27,33],[29,34,29,37],[30,0,30,7],[30,8,30,10],[30,11,30,13],[30,14,30,17],[30,18,30,21],[30,22,30,25],[30,26,30,29],[30,30,30,33],[30,34,30,37],[29,0,29,2],[29,3,29,7],[29,8,29,10],[29,11,29,13],[29,14,29,17],[29,18,29,21],[29,22,29,25],[29,26,29,29],[29,30,29,33],[31,0,31,6],[31,8,31,10],[31,11,31,13],[31,14,31,17],[31,18,32,20],[31,21,31,23],[31,24,31,37],[32,0,32,6],[32,8,32,10],[32,11,32,13],[32,14,32,17],[32,21,32,23],[32,24,32,37],[33,0,37,1],[33,2,33,3],[33,4,33,7],[33,8,33,9],[33,10,33,16],[33,17,33,19],[33,20,33,24],[34,2,34,5],[34,6,34,11],[34,12,34,17],[34,18,34,23],[34,24,34,37],[35,2,37,5],[35,8,35,10],[35,20,35,21],[36,8,36,10],[36,33,36,36],[37,6,37,7],[37,8,37,10],[37,13,37,17],[37,25,37,27],[38,0,42,1],[38,3,38,5],[38,6,38,10],[38,11,38,14],[38,15,38,17],[38,18,38,20],[40,3,40,4],[40,6,40,9],[40,11,40,13],[40,15,40,16],[40,18,40,19],[38,21,38,28],[38,29,38,37],[39,3,39,4],[39,6,39,9],[39,11,39,13],[39,15,39,16],[39,18,39,19],[39,21,39,28],[39,30,39,32],[40,21,40,28],[41,3,41,4],[41,6,41,9],[41,11,41,13],[41,15,41,16],[41,18,41,19],[41,21,41,28],[42,3,42,4],[42,6,42,9],[42,11,42,13],[42,15,42,16],[42,18,42,19],[42,21,42,28],[45,14,45,21],[46,1,46,12],[44,1,44,4],[44,14,44,21],[45,1,45,12],[45,22,45,33],[44,22,44,33],[48,26,48,37],[56,8,56,10],[56,11,56,13],[56,14,56,17],[56,18,56,21],[56,22,56,25],[56,26,56,29],[56,30,56,33],[56,34,56,37]]}
["別紙第13号書式"]
[null,null,null,null,"事　業　実　施　状　況　等　調　書"]
[]
["事業名",null,null,null,null,null,null,null,null,null,null,null,null,null,null,null,null,null,null,null,null,null,"計画期間",null,null,null,null,null,null,null,"年度～",null,null,null,"年度"]
["施行場所",null,null,null,null,null,null,null,null,null,null,null,null,null,null,null,null,null,null,null,null,null,"前年度以前施行済事業",null,null,null,null,null,null,null,"翌年度以降計画事業"]
["事業概要"]
[]
[]
[]
["事　業　費　内　訳",null,null,null,"事業開始日～\n事業完成(見込)日",null,null,null,"支出金額（単位：千円）",null,null,null,null,null,null,null,null,null,null,null,null,null,null,null,null,null,"支　出　状　況"]
[null,null,null,null,null,null,null,null,null,null,null,"（補助事業分）",null,null,"（単独事業分）",null,null,null,"決算額",null,null,null,"繰越額",null,null,null,"前月まで",null,null,null,null,null,"月",null,null,null,"月以降"]
[]
[]
[]
[]
[]
["計",null,null,null,null,null,null,"Ａ",{"$f":"SUM(I12:K16)","v":0},null,null,{"$f":"SUM(L12:N16)","v":0},null,null,{"$f":"SUM(O12:R16)","v":0},null,null,null,{"$f":"SUM(S12:V16)","v":0},null,null,null,{"$f":"SUM(W12:Z16)","v":0},null,null,null,{"$f":"SUM(AA12:AD16)","v":0},null,null,null,{"$f":"SUM(AE12:AH16)","v":0},null,null,null,{"$f":"SUM(AI12:AL16)","v":0}]
["財　源　内　訳",null,null,null,null,null,null,null,"収入金額（単位：千円）",null,null,null,null,null,null,null,null,null,null,null,null,null,null,null,null,null,"収　入　状　況"]
["項　目",null,null,"内　容",null,null,null,null,null,null,null,"（補助事業分）",null,null,"（単独事業分）",null,null,null,"決算額",null,null,null,"繰越額",null,null,null,"前月まで",null,null,null,null,null,"月",null,null,null,"月以降"]
["控除財源","国庫支出金",null,null,null,null,null,"Ｂ",null,null,null,null,null,null,null,null,null,null,null,null,null,null,null,null,null,null,null,null,null,null,null,null,null,null,null,null,null,null,null,null,"■該当なし（事務費を起債対象とせず）"]
[null,"都道府県支出金",null,null,null,null,null,"Ｃ",null,null,null,null,null,null,null,null,null,null,null,null,null,null,null,null,null,null,null,null,null,null,null,null,null,null,null,null,null,null,null,null,"■工事費の5.0％以内の額"]
[null,null,null,null,null,null,null,"Ｄ",null,null,null,null,null,null,null,null,null,null,null,null,null,null,null,null,null,null,null,null,null,null,null,null,null,null,null,null,null,null,null,null,"■廃止前の補助基準により定められていた計算方法により算出した範囲内の額"]
[null,null,null,null,null,null,null,"Ｅ",null,null,null,null,null,null,null,null,null,null,null,null,null,null,null,null,null,null,null,null,null,null,null,null,null,null,null,null,null,null,null,null,"■補助基準に定める範囲内の事務費"]
["起債","財政融資資金",null,"本債",null,null,null,"Ｆ"]
[null,null,null,null,null,null,null,"Ｇ",null,null,null,null,null,null,null,null,null,null,null,null,null,null,null,null,null,null,null,null,null,null,null,null,null,null,null,null,null,null,null,null,"■該当なし（事務費を起債対象とせず）"]
[null,"その他",null,null,null,null,null,"Ｈ",null,null,null,null,null,null,null,null,null,null,null,null,null,null,null,null,null,null,null,null,null,null,null,null,null,null,null,null,null,null,null,null,"■設計監督費（外部委託）について、実所要額"]
["一般財源",null,null,null,null,null,null,null,null,null,null,null,null,null,null,null,null,null,null,null,null,null,null,null,null,null,null,null,null,null,null,null,null,null,null,null,null,null,null,null,"■設計監督費（外部委託せず）について、全体事業費の2.75％以内の額"]
[null,null,null,null,null,null,null,null,null,null,null,null,null,null,null,null,null,null,null,null,null,null,null,null,null,null,null,null,null,null,null,null,null,null,null,null,null,null,null,null,"■設計監督費以外の事務費について、全体事業費の2.75％以内の額"]
[null,null,null,null,null,null,null,null,null,null,null,null,null,null,null,null,null,null,null,null,null,null,null,null,null,null,null,null,null,null,null,null,null,null,null,null,null,null,null,null,"■設計監督費（外部委託）の実所要額、及びそれ以外の事務費について全体事業費の2.75％以内の額"]
["一時立替金",null,null,null,null,null,null,null,null,null,null,null,null,null,null,null,null,null,null,null,null,null,null,null,null,null,null,null,null,null,null,null,null,null,null,null,null,null,null,null,"■設計監督費（外部委託せず）及びそれ以外の事務費について、それぞれ全体事業費の2.75％以内の額　"]
["計",null,null,null,null,null,null,null,{"$f":"SUM(I20:K30)","v":0},null,null,{"$f":"SUM(L20:N30)","v":0},null,null,{"$f":"SUM(O20:R30)","v":0},null,null,null,{"$f":"SUM(S20:V30)","v":0},null,null,null,{"$f":"SUM(W20:Z30)","v":0},null,null,null,{"$f":"SUM(AD20:AD30)","v":0},null,null,null,{"$f":"SUM(AH20:AH30)","v":0},null,null,null,{"$f":"SUM(AI20:AL30)","v":0},null,null,null,null,null,"■設計監督費と合わせて全体事業費の6.0％以内の額（水道、港湾、下水道）"]
["借入時充当率((Ｆ+Ｇ+Ｈ)/(Ａ-Ｂ-Ｃ-Ｄ-Ｅ)×100)",null,null,null,null,null,null,"(％)",{"$f":"IF(I31>0,(I24+I25+I26)/(I17-I20-I21-I22-I23),\"\")","v":""},null,null,{"$f":"IF(L31>0,(L24+L25+L26)/(L17-L20-L21-L22-L23),\"\")","v":""},null,null,{"$f":"IF(O31>0,(O24+O25+O26)/(O17-O20-O21-O23),\"\")","v":""},null,null,null,"起債対象\n事 務 費",null,null,"（補助事業分）",null,null,null,null,null,null,null,null,null,null,null,null,null,null,null,null,null,null,"■適正必要額（交通）"]
["基準充当率",null,null,null,null,null,null,"(％)",null,null,null,null,null,null,null,null,null,null,null,null,null,"（単独事業分）",null,null,null,null,null,null,null,null,null,null,null,null,null,null,null,null,null,null,"■補助事業と同様の計算方法により算出した範囲内の額（災害復旧）"]
["起債に関する\n予算の定め",null,"年度",null,null,null,null,null,"会計名",null,null,null,null,null,null,null,null,"議決等年月日",null,null,null,null,null,null,null,"（□","議決済",null,"□","議決予定",null,"□","専決済",null,"□","専決予定）",null,null,null,null,"■実績等に応じ、必要な額"]
[null,null,"起債の目的",null,null,null,"起債限度額（うち財政融資資金）",null,null,null,null,null,"起債の方法",null,null,null,null,null,"利率",null,null,null,null,null,"償還の方法"]
[null,null,null,null,null,null,null,null,null,null,null,null,"□","証書借入",null,"□","普通貸借",null,null,"年利",null,null,"％以内",null,"□","年賦",null,"□","半年賦",null,"□","元利均等",null,"□","元金均等",null,null,null,null,null,"有"]
[null,null,null,null,null,null,null,null,null,null,null,"千円","□","証券発行",null,null,null,null,null,null,null,null,"利率見直しに関する ",null,"□","融資条件による",null,null,null,null,"□","その他（",null,null,null,null,null,"）",null,null,"無"]
[null,null,null,null,null,null," （うち",null,null,null,null,"千円)","□","その他（　　　　　　）",null,null,null,null,null,null,null,null,"但し書きの有無：",null,"□","償還期間：",null,null,null,"年（うち据置期間：",null,null,null,null,"年）"]
["起債同意\n（許可）",null,null,"年月日（予定）",null,null,"同意（許可）額",null,null,null,null,"うち本件借入分",null,null,null,"償還年限",null,null,"うち据置期間",null,null,"備考",null,null,null,null,null,null,null,"地方長期資金等借入申込み償還期限等",null,null,null,null,null,null,null,null,null,null,"（□"]
[null,null,"①",null,null,null,null,null,null,null,"千円",null,null,null,"千円",null,null,"年",null,null,"年",null,null,null,null,null,null,null,null,null,"償還期限：",null,null,null,"年",null,null,null,null,null,"（■"]
[null,null,"②",null,null,null,null,null,null,null,"千円",null,null,null,"千円",null,null,"年",null,null,"年",null,null,null,null,null,null,null,null,null,"うち据置期間：",null,null,null,"年",null,null,null,null,null,"□"]
[null,null,"③",null,null,null,null,null,null,null,"千円",null,null,null,"千円",null,null,"年",null,null,"年",null,null,null,null,null,null,null,null,null,null,null,null,null,null,null,null,null,null,null,"■"]
[null,null,"④",null,null,null,null,null,null,null,"千円",null,null,null,"千円",null,null,"年",null,null,"年"]
["その他参考",null,null,null,null,null,null,null,null,null,null,null,null,null,null,null,null,null,null,null,null,null,null,null,null,null,null,null,null,null,null,null,null,null,null,null,null,null,null,null,"（予定）"]
[null,"①借入額の算出式",null,null,null,null,null,null,null,null,null,null,null,null,"②借入に係る振込口座変更の要否",null,null,null,null,null,null,null,"③貸付日時点における事業の進捗状況"]
[null,"　　≪補助分≫",null,null,null,null,null,null,null,null,null,null,null,null,"　要　　/　　否",null,null,null,null,null,null,null,null,null,null,null,null,null,null,null,null,null,null,null,null,null,null,null,null,null,"要"]
[null,"　　≪単独分≫",null,null,null,null,null,null,null,null,null,null,null,null,null,null,null,null,null,null,null,null,null,null,null,null,null,null,null,null,null,null,null,null,null,null,null,null,null,null,"否"]
[]
[]
["備考"]
[null,"1．用紙の大きさは、日本産業規格Ａ列４とする。"]
[null,"2．事業費内訳には、起債対象となる費用のみ記入する。"]
[null,"3．収支金額、収支状況の各計は一致する。"]
[null,"4．収支状況は、借入月を「　月」欄に記入する。"]
[]
[]
[null,null,null,null,null,null,null,null,{"$f":"IF(I$31=I$17,\"ok\",\"ng\")","v":"ok"},null,null,{"$f":"IF(L$31=L$17,\"ok\",\"ng\")","v":"ok"},null,null,{"$f":"IF(O$31=O$17,\"ok\",\"ng\")","v":"ok"},null,null,null,{"$f":"IF(S$31=S$17,\"ok\",\"ng\")","v":"ok"},null,null,null,{"$f":"IF(W$31=W$17,\"ok\",\"ng\")","v":"ok"},null,null,null,{"$f":"IF(AA$31=AA$17,\"ok\",\"ng\")","v":"ok"},null,null,null,{"$f":"IF(AE$31=AE$17,\"ok\",\"ng\")","v":"ok"},null,null,null,{"$f":"IF(AI$31=AI$17,\"ok\",\"ng\")","v":"ok"}]

{"sheet":"start","index":3,"n_rows":0,"n_cols":0,"rows_kept":0,"cut":false,"hidden":false,"merged":[]}

{"sheet":"1","index":4,"n_rows":57,"n_cols":41,"rows_kept":57,"cut":false,"hidden":false,"merged":[[46,1,46,12],[48,26,48,37],[56,8,56,10],[56,11,56,13],[56,14,56,17],[56,18,56,21],[56,22,56,25],[56,26,56,29],[56,30,56,33],[56,34,56,37],[38,29,38,37],[39,3,39,4],[39,6,39,9],[39,11,39,13],[39,15,39,16],[39,18,39,19],[39,21,39,28],[39,30,39,32],[42,3,42,4],[42,6,42,9],[42,11,42,13],[42,15,42,16],[42,18,42,19],[42,21,42,28],[40,18,40,19],[40,21,40,28],[41,3,41,4],[41,6,41,9],[41,11,41,13],[41,15,41,16],[41,18,41,19],[41,21,41,28],[37,6,37,7],[37,8,37,10],[37,13,37,17],[37,25,37,27],[38,0,42,1],[38,3,38,5],[38,6,38,10],[38,11,38,14],[38,15,38,17],[38,18,38,20],[40,3,40,4],[40,6,40,9],[40,11,40,13],[40,15,40,16],[38,21,38,28],[30,30,30,33],[30,34,30,37],[31,0,31,6],[31,8,31,10],[31,11,31,13],[31,14,31,17],[31,18,32,20],[31,21,31,23],[31,24,31,37],[32,0,32,6],[32,8,32,10],[32,11,32,13],[32,14,32,17],[32,21,32,23],[32,24,32,37],[30,0,30,7],[30,8,30,10],[30,11,30,13],[30,14,30,17],[30,18,30,21],[30,22,30,25],[30,26,30,29],[33,0,37,1],[33,2,33,3],[33,4,33,7],[33,8,33,9],[33,10,33,16],[33,17,33,19],[33,20,33,24],[34,2,34,5],[34,6,34,11],[34,12,34,17],[34,18,34,23],[34,24,34,37],[35,2,37,5],[35,8,35,10],[35,20,35,21],[36,8,36,10],[36,33,36,36],[28,34,28,37],[29,0,29,2],[29,3,29,7],[29,8,29,10],[29,11,29,13],[29,14,29,17],[29,18,29,21],[29,22,29,25],[29,26,29,29],[29,30,29,33],[29,34,29,37],[28,0,28,2],[28,3,28,7],[28,8,28,10],[28,11,28,13],[28,14,28,17],[28,18,28,21],[28,22,28,25],[28,26,28,29],[28,30,28,33],[26,30,26,33],[26,34,26,37],[27,0,27,2],[27,3,27,7],[27,8,27,10],[27,11,27,13],[27,14,27,17],[27,18,27,21],[27,22,27,25],[27,26,27,29],[27,30,27,33],[27,34,27,37],[26,0,26,2],[26,3,26,7],[26,8,26,10],[26,11,26,13],[26,14,26,17],[26,18,26,21],[26,22,26,25],[23,0,25,0],[26,26,26,29],[24,26,24,29],[24,30,24,33],[24,34,24,37],[25,1,25,2],[25,3,25,6],[25,8,25,10],[25,11,25,13],[25,14,25,17],[25,18,25,21],[25,22,25,25],[24,3,24,6],[24,8,24,10],[24,11,24,13],[24,14,24,17],[24,18,24,21],[24,22,24,25],[23,1,24,2],[23,3,23,6],[23,8,23,10],[23,11,23,13],[25,26,25,29],[25,30,25,33],[25,34,25,37],[21,34,21,37],[22,1,22,2],[22,3,22,6],[22,8,22,10],[22,11,22,13],[22,14,22,17],[23,14,23,17],[23,18,23,21],[23,22,23,25],[23,26,23,29],[23,30,23,33],[23,34,23,37],[22,18,22,21],[22,22,22,25],[22,26,22,29],[22,30,22,33],[22,34,22,37],[19,34,19,37],[20,1,20,2],[20,3,20,6],[20,8,20,10],[20,11,20,13],[20,14,20,17],[20,18,20,21],[20,22,20,25],[20,26,20,29],[20,30,20,33],[20,34,20,37],[19,0,22,0],[19,1,19,2],[19,3,19,6],[19,8,19,10],[19,11,19,13],[19,14,19,17],[18,22,18,25],[18,26,18,29],[18,30,18,31],[19,18,19,21],[19,22,19,25],[19,26,19,29],[19,30,19,33],[21,1,21,2],[21,3,21,6],[21,8,21,10],[21,11,21,13],[21,14,21,17],[21,18,21,21],[21,22,21,25],[21,26,21,29],[21,30,21,33],[18,32,18,33],[18,34,18,35],[18,36,18,37],[18,0,18,2],[18,3,18,7],[18,8,18,10],[18,11,18,13],[18,14,18,17],[18,18,18,21],[17,0,17,7],[17,8,17,25],[17,26,17,37],[15,22,15,25],[15,26,15,29],[15,30,15,33],[15,34,15,37],[16,0,16,6],[16,8,16,10],[16,11,16,13],[16,14,16,17],[16,18,16,21],[16,22,16,25],[15,0,15,3],[15,4,15,7],[15,8,15,10],[15,11,15,13],[15,14,15,17],[15,18,15,21],[16,26,16,29],[16,30,16,33],[16,34,16,37],[13,34,13,37],[14,0,14,3],[14,4,14,7],[14,8,14,10],[14,11,14,13],[14,14,14,17],[14,18,14,21],[14,22,14,25],[14,26,14,29],[14,30,14,33],[14,34,14,37],[13,0,13,3],[13,4,13,7],[13,8,13,10],[13,11,13,13],[13,14,13,17],[13,18,13,21],[13,22,13,25],[13,26,13,29],[13,30,13,33],[11,22,11,25],[11,26,11,29],[11,30,11,33],[11,34,11,37],[12,0,12,3],[12,4,12,7],[12,8,12,10],[12,11,12,13],[12,14,12,17],[12,18,12,21],[12,22,12,25],[12,26,12,29],[12,30,12,33],[12,34,12,37],[9,0,10,3],[9,4,10,7],[9,8,9,25],[9,26,9,37],[10,8,10,10],[10,11,10,13],[10,14,10,17],[10,18,10,21],[10,22,10,25],[10,26,10,29],[0,28,0,37],[1,4,1,32],[1,33,1,37],[3,0,3,1],[3,2,3,21],[3,22,3,25],[3,28,3,29],[3,30,3,31],[3,32,3,33],[3,34,3,35],[44,1,44,4],[44,14,44,21],[45,1,45,12],[45,14,45,21],[45,22,45,33],[44,22,44,33],[4,0,4,1],[4,2,4,21],[4,22,4,29],[4,30,4,37],[5,0,8,1],[5,2,8,21],[5,22,8,29],[5,30,8,37],[10,30,10,31],[10,32,10,33],[10,34,10,35],[10,36,10,37],[11,0,11,3],[11,4,11,7],[11,8,11,10],[11,11,11,13],[11,14,11,17],[11,18,11,21]]}
["別紙第13号書式"]
[null,null,null,null,"事　業　実　施　状　況　等　調　書"]
[]
["事業名",null,null,null,null,null,null,null,null,null,null,null,null,null,null,null,null,null,null,null,null,null,"計画期間",null,null,null,null,null,null,null,"年度～",null,null,null,"年度"]
["施行場所",null,null,null,null,null,null,null,null,null,null,null,null,null,null,null,null,null,null,null,null,null,"前年度以前施行済事業",null,null,null,null,null,null,null,"翌年度以降計画事業"]
["事業概要"]
[]
[]
[]
["事　業　費　内　訳",null,null,null,"事業開始日～\n事業完成(見込)日",null,null,null,"支出金額（単位：千円）",null,null,null,null,null,null,null,null,null,null,null,null,null,null,null,null,null,"支　出　状　況"]
[null,null,null,null,null,null,null,null,null,null,null,"（補助事業分）",null,null,"（単独事業分）",null,null,null,"決算額",null,null,null,"繰越額",null,null,null,"前月まで",null,null,null,null,null,"月",null,null,null,"月以降"]
[]
[]
[]
[]
[]
["計",null,null,null,null,null,null,"Ａ",{"$f":"SUM(I12:K16)","v":0},null,null,{"$f":"SUM(L12:N16)","v":0},null,null,{"$f":"SUM(O12:R16)","v":0},null,null,null,{"$f":"SUM(S12:V16)","v":0},null,null,null,{"$f":"SUM(W12:Z16)","v":0},null,null,null,{"$f":"SUM(AA12:AD16)","v":0},null,null,null,{"$f":"SUM(AE12:AH16)","v":0},null,null,null,{"$f":"SUM(AI12:AL16)","v":0}]
["財　源　内　訳",null,null,null,null,null,null,null,"収入金額（単位：千円）",null,null,null,null,null,null,null,null,null,null,null,null,null,null,null,null,null,"収　入　状　況"]
["項　目",null,null,"内　容",null,null,null,null,null,null,null,"（補助事業分）",null,null,"（単独事業分）",null,null,null,"決算額",null,null,null,"繰越額",null,null,null,"前月まで",null,null,null,null,null,"月",null,null,null,"月以降"]
["控除財源","国庫支出金",null,null,null,null,null,"Ｂ",null,null,null,null,null,null,null,null,null,null,null,null,null,null,null,null,null,null,null,null,null,null,null,null,null,null,null,null,null,null,null,null,"■該当なし（事務費を起債対象とせず）"]
[null,"都道府県支出金",null,null,null,null,null,"Ｃ",null,null,null,null,null,null,null,null,null,null,null,null,null,null,null,null,null,null,null,null,null,null,null,null,null,null,null,null,null,null,null,null,"■工事費の5.0％以内の額"]
[null,null,null,null,null,null,null,"Ｄ",null,null,null,null,null,null,null,null,null,null,null,null,null,null,null,null,null,null,null,null,null,null,null,null,null,null,null,null,null,null,null,null,"■廃止前の補助基準により定められていた計算方法により算出した範囲内の額"]
[null,null,null,null,null,null,null,"Ｅ",null,null,null,null,null,null,null,null,null,null,null,null,null,null,null,null,null,null,null,null,null,null,null,null,null,null,null,null,null,null,null,null,"■補助基準に定める範囲内の事務費"]
["起債","財政融資資金",null,"本債",null,null,null,"Ｆ"]
[null,null,null,null,null,null,null,"Ｇ",null,null,null,null,null,null,null,null,null,null,null,null,null,null,null,null,null,null,null,null,null,null,null,null,null,null,null,null,null,null,null,null,"■該当なし（事務費を起債対象とせず）"]
[null,"その他",null,null,null,null,null,"Ｈ",null,null,null,null,null,null,null,null,null,null,null,null,null,null,null,null,null,null,null,null,null,null,null,null,null,null,null,null,null,null,null,null,"■設計監督費（外部委託）について、実所要額"]
["一般財源",null,null,null,null,null,null,null,null,null,null,null,null,null,null,null,null,null,null,null,null,null,null,null,null,null,null,null,null,null,null,null,null,null,null,null,null,null,null,null,"■設計監督費（外部委託せず）について、全体事業費の2.75％以内の額"]
[null,null,null,null,null,null,null,null,null,null,null,null,null,null,null,null,null,null,null,null,null,null,null,null,null,null,null,null,null,null,null,null,null,null,null,null,null,null,null,null,"■設計監督費以外の事務費について、全体事業費の2.75％以内の額"]
[null,null,null,null,null,null,null,null,null,null,null,null,null,null,null,null,null,null,null,null,null,null,null,null,null,null,null,null,null,null,null,null,null,null,null,null,null,null,null,null,"■設計監督費（外部委託）の実所要額、及びそれ以外の事務費について全体事業費の2.75％以内の額"]
["一時立替金",null,null,null,null,null,null,null,null,null,null,null,null,null,null,null,null,null,null,null,null,null,null,null,null,null,null,null,null,null,null,null,null,null,null,null,null,null,null,null,"■設計監督費（外部委託せず）及びそれ以外の事務費について、それぞれ全体事業費の2.75％以内の額　"]
["計",null,null,null,null,null,null,null,{"$f":"SUM(I20:K30)","v":0},null,null,{"$f":"SUM(L20:N30)","v":0},null,null,{"$f":"SUM(O20:R30)","v":0},null,null,null,{"$f":"SUM(S20:V30)","v":0},null,null,null,{"$f":"SUM(W20:Z30)","v":0},null,null,null,{"$f":"SUM(AA20:AD30)","v":0},null,null,null,{"$f":"SUM(AE20:AH30)","v":0},null,null,null,{"$f":"SUM(AI20:AL30)","v":0},null,null,null,null,null,"■設計監督費と合わせて全体事業費の6.0％以内の額（水道、港湾、下水道）"]
["借入時充当率((Ｆ+Ｇ+Ｈ)/(Ａ-Ｂ-Ｃ-Ｄ-Ｅ)×100)",null,null,null,null,null,null,"(％)",{"$f":"IF(I31>0,(I24+I25+I26)/(I17-I20-I21-I22-I23),\"\")","v":""},null,null,{"$f":"IF(L31>0,(L24+L25+L26)/(L17-L20-L21-L22-L23),\"\")","v":""},null,null,{"$f":"IF(O31>0,(O24+O25+O26)/(O17-O20-O21-O23),\"\")","v":""},null,null,null,"起債対象\n事 務 費",null,null,"（補助事業分）",null,null,null,null,null,null,null,null,null,null,null,null,null,null,null,null,null,null,"■適正必要額（交通）"]
["基準充当率",null,null,null,null,null,null,"(％)",null,null,null,null,null,null,null,null,null,null,null,null,null,"（単独事業分）",null,null,null,null,null,null,null,null,null,null,null,null,null,null,null,null,null,null,"■補助事業と同様の計算方法により算出した範囲内の額（災害復旧）"]
["起債に関する\n予算の定め",null,"年度",null,null,null,null,null,"会計名",null,null,null,null,null,null,null,null,"議決等年月日",null,null,null,null,null,null,null,"（□","議決済",null,"□","議決予定",null,"□","専決済",null,"□","専決予定）",null,null,null,null,"■実績等に応じ、必要な額"]
[null,null,"起債の目的",null,null,null,"起債限度額（うち財政融資資金）",null,null,null,null,null,"起債の方法",null,null,null,null,null,"利率",null,null,null,null,null,"償還の方法"]
[null,null,null,null,null,null,null,null,null,null,null,null,"□","証書借入",null,"□","普通貸借",null,null,"年利",null,null,"％以内",null,"□","年賦",null,"□","半年賦",null,"□","元利均等",null,"□","元金均等",null,null,null,null,null,"有"]
[null,null,null,null,null,null,null,null,null,null,null,"千円","□","証券発行",null,null,null,null,null,null,null,null,"利率見直しに関する ",null,"□","融資条件による",null,null,null,null,"□","その他（",null,null,null,null,null,"）",null,null,"無"]
[null,null,null,null,null,null," （うち",null,null,null,null,"千円)","□","その他（　　　　　　）",null,null,null,null,null,null,null,null,"但し書きの有無：",null,"□","償還期間：",null,null,null,"年（うち据置期間：",null,null,null,null,"年）"]
["起債同意\n（許可）",null,null,"年月日（予定）",null,null,"同意（許可）額",null,null,null,null,"うち本件借入分",null,null,null,"償還年限",null,null,"うち据置期間",null,null,"備考",null,null,null,null,null,null,null,"地方長期資金等借入申込み償還期限等",null,null,null,null,null,null,null,null,null,null,"（□"]
[null,null,"①",null,null,null,null,null,null,null,"千円",null,null,null,"千円",null,null,"年",null,null,"年",null,null,null,null,null,null,null,null,null,"償還期限：",null,null,null,"年",null,null,null,null,null,"（■"]
[null,null,"②",null,null,null,null,null,null,null,"千円",null,null,null,"千円",null,null,"年",null,null,"年",null,null,null,null,null,null,null,null,null,"うち据置期間：",null,null,null,"年",null,null,null,null,null,"□"]
[null,null,"③",null,null,null,null,null,null,null,"千円",null,null,null,"千円",null,null,"年",null,null,"年",null,null,null,null,null,null,null,null,null,null,null,null,null,null,null,null,null,null,null,"■"]
[null,null,"④",null,null,null,null,null,null,null,"千円",null,null,null,"千円",null,null,"年",null,null,"年"]
["その他参考",null,null,null,null,null,null,null,null,null,null,null,null,null,null,null,null,null,null,null,null,null,null,null,null,null,null,null,null,null,null,null,null,null,null,null,null,null,null,null,"（予定）"]
[null,"①借入額の算出式",null,null,null,null,null,null,null,null,null,null,null,null,"②借入に係る振込口座変更の要否",null,null,null,null,null,null,null,"③貸付日時点における事業の進捗状況"]
[null,"　　≪補助分≫",null,null,null,null,null,null,null,null,null,null,null,null,"　要　　/　　否",null,null,null,null,null,null,null,null,null,null,null,null,null,null,null,null,null,null,null,null,null,null,null,null,null,"要"]
[null,"　　≪単独分≫",null,null,null,null,null,null,null,null,null,null,null,null,null,null,null,null,null,null,null,null,null,null,null,null,null,null,null,null,null,null,null,null,null,null,null,null,null,null,"否"]
[]
[]
["備考"]
[null,"1．用紙の大きさは、日本産業規格Ａ列４とする。"]
[null,"2．事業費内訳には、起債対象となる費用のみ記入する。"]
[null,"3．収支金額、収支状況の各計は一致する。"]
[null,"4．収支状況は、借入月を「　月」欄に記入する。"]
[]
[]
[null,null,null,null,null,null,null,null,{"$f":"IF(I$31=I$17,\"ok\",\"ng\")","v":"ok"},null,null,{"$f":"IF(L$31=L$17,\"ok\",\"ng\")","v":"ok"},null,null,{"$f":"IF(O$31=O$17,\"ok\",\"ng\")","v":"ok"},null,null,null,{"$f":"IF(S$31=S$17,\"ok\",\"ng\")","v":"ok"},null,null,null,{"$f":"IF(W$31=W$17,\"ok\",\"ng\")","v":"ok"},null,null,null,{"$f":"IF(AA$31=AA$17,\"ok\",\"ng\")","v":"ok"},null,null,null,{"$f":"IF(AE$31=AE$17,\"ok\",\"ng\")","v":"ok"},null,null,null,{"$f":"IF(AI$31=AI$17,\"ok\",\"ng\")","v":"ok"}]

{"sheet":"2","index":5,"n_rows":57,"n_cols":41,"rows_kept":57,"cut":false,"hidden":false,"merged":[[48,26,48,37],[56,8,56,10],[56,11,56,13],[56,14,56,17],[56,18,56,21],[56,22,56,25],[56,26,56,29],[56,30,56,33],[56,34,56,37],[38,29,38,37],[39,3,39,4],[39,6,39,9],[39,11,39,13],[39,15,39,16],[39,18,39,19],[39,21,39,28],[39,30,39,32],[42,3,42,4],[42,6,42,9],[42,11,42,13],[42,15,42,16],[42,18,42,19],[42,21,42,28],[40,18,40,19],[40,21,40,28],[41,3,41,4],[41,6,41,9],[41,11,41,13],[41,15,41,16],[41,18,41,19],[41,21,41,28],[37,6,37,7],[37,8,37,10],[37,13,37,17],[37,25,37,27],[38,0,42,1],[38,3,38,5],[38,6,38,10],[38,11,38,14],[38,15,38,17],[38,18,38,20],[40,3,40,4],[40,6,40,9],[40,11,40,13],[40,15,40,16],[38,21,38,28],[30,30,30,33],[30,34,30,37],[31,0,31,6],[31,8,31,10],[31,11,31,13],[31,14,31,17],[31,18,32,20],[31,21,31,23],[31,24,31,37],[32,0,32,6],[32,8,32,10],[32,11,32,13],[32,14,32,17],[32,21,32,23],[32,24,32,37],[30,0,30,7],[30,8,30,10],[30,11,30,13],[30,14,30,17],[30,18,30,21],[30,22,30,25],[30,26,30,29],[33,0,37,1],[33,2,33,3],[33,4,33,7],[33,8,33,9],[33,10,33,16],[33,17,33,19],[33,20,33,24],[34,2,34,5],[34,6,34,11],[34,12,34,17],[34,18,34,23],[34,24,34,37],[35,2,37,5],[35,8,35,10],[35,20,35,21],[36,8,36,10],[36,33,36,36],[28,34,28,37],[29,0,29,2],[29,3,29,7],[29,8,29,10],[29,11,29,13],[29,14,29,17],[29,18,29,21],[29,22,29,25],[29,26,29,29],[29,30,29,33],[29,34,29,37],[28,0,28,2],[28,3,28,7],[28,8,28,10],[28,11,28,13],[28,14,28,17],[28,18,28,21],[28,22,28,25],[28,26,28,29],[28,30,28,33],[26,30,26,33],[26,34,26,37],[27,0,27,2],[27,3,27,7],[27,8,27,10],[27,11,27,13],[27,14,27,17],[27,18,27,21],[27,22,27,25],[27,26,27,29],[27,30,27,33],[27,34,27,37],[26,0,26,2],[26,3,26,7],[26,8,26,10],[26,11,26,13],[26,14,26,17],[26,18,26,21],[26,22,26,25],[23,0,25,0],[26,26,26,29],[24,26,24,29],[24,30,24,33],[24,34,24,37],[25,1,25,2],[25,3,25,6],[25,8,25,10],[25,11,25,13],[25,14,25,17],[25,18,25,21],[25,22,25,25],[24,3,24,6],[24,8,24,10],[24,11,24,13],[24,14,24,17],[24,18,24,21],[24,22,24,25],[23,1,24,2],[23,3,23,6],[23,8,23,10],[23,11,23,13],[25,26,25,29],[25,30,25,33],[25,34,25,37],[21,34,21,37],[22,1,22,2],[22,3,22,6],[22,8,22,10],[22,11,22,13],[22,14,22,17],[23,14,23,17],[23,18,23,21],[23,22,23,25],[23,26,23,29],[23,30,23,33],[23,34,23,37],[22,18,22,21],[22,22,22,25],[22,26,22,29],[22,30,22,33],[22,34,22,37],[19,34,19,37],[20,1,20,2],[20,3,20,6],[20,8,20,10],[20,11,20,13],[20,14,20,17],[20,18,20,21],[20,22,20,25],[20,26,20,29],[20,30,20,33],[20,34,20,37],[19,0,22,0],[19,1,19,2],[19,3,19,6],[19,8,19,10],[19,11,19,13],[19,14,19,17],[18,22,18,25],[18,26,18,29],[18,30,18,31],[19,18,19,21],[19,22,19,25],[19,26,19,29],[19,30,19,33],[21,1,21,2],[21,3,21,6],[21,8,21,10],[21,11,21,13],[21,14,21,17],[21,18,21,21],[21,22,21,25],[21,26,21,29],[21,30,21,33],[18,32,18,33],[18,34,18,35],[18,36,18,37],[18,0,18,2],[18,3,18,7],[18,8,18,10],[18,11,18,13],[18,14,18,17],[18,18,18,21],[17,0,17,7],[17,8,17,25],[17,26,17,37],[15,22,15,25],[15,26,15,29],[15,30,15,33],[15,34,15,37],[16,0,16,6],[16,8,16,10],[16,11,16,13],[16,14,16,17],[16,18,16,21],[16,22,16,25],[14,34,14,37],[15,0,15,3],[15,4,15,7],[15,8,15,10],[15,11,15,13],[15,14,15,17],[15,18,15,21],[16,26,16,29],[16,30,16,33],[16,34,16,37],[14,0,14,3],[14,4,14,7],[14,8,14,10],[14,11,14,13],[14,14,14,17],[14,18,14,21],[14,22,14,25],[14,26,14,29],[14,30,14,33],[12,34,12,37],[13,0,13,3],[13,4,13,7],[13,8,13,10],[13,11,13,13],[13,14,13,17],[13,18,13,21],[13,22,13,25],[13,26,13,29],[13,30,13,33],[13,34,13,37],[12,0,12,3],[12,4,12,7],[12,8,12,10],[12,11,12,13],[12,14,12,17],[12,18,12,21],[12,22,12,25],[12,26,12,29],[12,30,12,33],[10,30,10,31],[10,32,10,33],[10,34,10,35],[10,36,10,37],[11,0,11,3],[11,4,11,7],[11,8,11,10],[11,11,11,13],[11,14,11,17],[11,18,11,21],[9,0,10,3],[9,4,10,7],[9,8,9,25],[9,26,9,37],[10,8,10,10],[10,11,10,13],[10,14,10,17],[10,18,10,21],[10,22,10,25],[10,26,10,29],[11,22,11,25],[11,26,11,29],[11,30,11,33],[11,34,11,37],[4,0,4,1],[4,2,4,21],[4,22,4,29],[4,30,4,37],[5,0,8,1],[5,2,8,21],[5,22,8,29],[5,30,8,37],[0,28,0,37],[1,4,1,32],[1,33,1,37],[3,0,3,1],[3,2,3,21],[3,22,3,25],[3,28,3,29],[3,30,3,31],[3,32,3,33],[3,34,3,35],[45,22,45,33],[44,22,44,33],[47,1,47,12],[44,1,44,4],[44,14,44,21],[45,1,45,12],[45,14,45,21],[46,1,46,12],[46,14,46,21],[46,22,46,29]]}
["別紙第13号書式"]
[null,null,null,null,"事　業　実　施　状　況　等　調　書"]
[]
["事業名",null,null,null,null,null,null,null,null,null,null,null,null,null,null,null,null,null,null,null,null,null,"計画期間",null,null,null,null,null,null,null,"年度～",null,null,null,"年度"]
["施行場所",null,null,null,null,null,null,null,null,null,null,null,null,null,null,null,null,null,null,null,null,null,"前年度以前施行済事業",null,null,null,null,null,null,null,"翌年度以降計画事業"]
["事業概要"]
[]
[]
[]
["事　業　費　内　訳",null,null,null,"事業開始日～\n事業完成(見込)日",null,null,null,"支出金額（単位：千円）",null,null,null,null,null,null,null,null,null,null,null,null,null,null,null,null,null,"支　出　状　況"]
[null,null,null,null,null,null,null,null,null,null,null,"（補助事業分）",null,null,"（単独事業分）",null,null,null,"決算額",null,null,null,"繰越額",null,null,null,"前月まで",null,null,null,null,null,"月",null,null,null,"月以降"]
[]
[]
[]
[]
[]
["計",null,null,null,null,null,null,"Ａ",{"$f":"SUM(I12:K16)","v":0},null,null,{"$f":"SUM(L12:N16)","v":0},null,null,{"$f":"SUM(O12:R16)","v":0},null,null,null,{"$f":"SUM(S12:V16)","v":0},null,null,null,{"$f":"SUM(W12:Z16)","v":0},null,null,null,{"$f":"SUM(AA12:AD16)","v":0},null,null,null,{"$f":"SUM(AE12:AH16)","v":0},null,null,null,{"$f":"SUM(AI12:AL16)","v":0}]
["財　源　内　訳",null,null,null,null,null,null,null,"収入金額（単位：千円）",null,null,null,null,null,null,null,null,null,null,null,null,null,null,null,null,null,"収　入　状　況"]
["項　目",null,null,"内　容",null,null,null,null,null,null,null,"（補助事業分）",null,null,"（単独事業分）",null,null,null,"決算額",null,null,null,"繰越額",null,null,null,"前月まで",null,null,null,null,null,"月",null,null,null,"月以降"]
["控除財源","国庫支出金",null,null,null,null,null,"Ｂ",null,null,null,null,null,null,null,null,null,null,null,null,null,null,null,null,null,null,null,null,null,null,null,null,null,null,null,null,null,null,null,null,"■該当なし（事務費を起債対象とせず）"]
[null,"都道府県支出金",null,null,null,null,null,"Ｃ",null,null,null,null,null,null,null,null,null,null,null,null,null,null,null,null,null,null,null,null,null,null,null,null,null,null,null,null,null,null,null,null,"■工事費の5.0％以内の額"]
[null,null,null,null,null,null,null,"Ｄ",null,null,null,null,null,null,null,null,null,null,null,null,null,null,null,null,null,null,null,null,null,null,null,null,null,null,null,null,null,null,null,null,"■廃止前の補助基準により定められていた計算方法により算出した範囲内の額"]
[null,null,null,null,null,null,null,"Ｅ",null,null,null,null,null,null,null,null,null,null,null,null,null,null,null,null,null,null,null,null,null,null,null,null,null,null,null,null,null,null,null,null,"■補助基準に定める範囲内の事務費"]
["起債","財政融資資金",null,"本債",null,null,null,"Ｆ"]
[null,null,null,null,null,null,null,"Ｇ",null,null,null,null,null,null,null,null,null,null,null,null,null,null,null,null,null,null,null,null,null,null,null,null,null,null,null,null,null,null,null,null,"■該当なし（事務費を起債対象とせず）"]
[null,"その他",null,null,null,null,null,"Ｈ",null,null,null,null,null,null,null,null,null,null,null,null,null,null,null,null,null,null,null,null,null,null,null,null,null,null,null,null,null,null,null,null,"■設計監督費（外部委託）について、実所要額"]
["一般財源",null,null,null,null,null,null,null,null,null,null,null,null,null,null,null,null,null,null,null,null,null,null,null,null,null,null,null,null,null,null,null,null,null,null,null,null,null,null,null,"■設計監督費（外部委託せず）について、全体事業費の2.75％以内の額"]
[null,null,null,null,null,null,null,null,null,null,null,null,null,null,null,null,null,null,null,null,null,null,null,null,null,null,null,null,null,null,null,null,null,null,null,null,null,null,null,null,"■設計監督費以外の事務費について、全体事業費の2.75％以内の額"]
[null,null,null,null,null,null,null,null,null,null,null,null,null,null,null,null,null,null,null,null,null,null,null,null,null,null,null,null,null,null,null,null,null,null,null,null,null,null,null,null,"■設計監督費（外部委託）の実所要額、及びそれ以外の事務費について全体事業費の2.75％以内の額"]
["一時立替金",null,null,null,null,null,null,null,null,null,null,null,null,null,null,null,null,null,null,null,null,null,null,null,null,null,null,null,null,null,null,null,null,null,null,null,null,null,null,null,"■設計監督費（外部委託せず）及びそれ以外の事務費について、それぞれ全体事業費の2.75％以内の額　"]
["計",null,null,null,null,null,null,null,{"$f":"SUM(I20:K30)","v":0},null,null,{"$f":"SUM(L20:N30)","v":0},null,null,{"$f":"SUM(O20:R30)","v":0},null,null,null,{"$f":"SUM(S20:V30)","v":0},null,null,null,{"$f":"SUM(W20:Z30)","v":0},null,null,null,{"$f":"SUM(AA20:AD30)","v":0},null,null,null,{"$f":"SUM(AE20:AH30)","v":0},null,null,null,{"$f":"SUM(AI20:AL30)","v":0},null,null,null,null,null,"■設計監督費と合わせて全体事業費の6.0％以内の額（水道、港湾、下水道）"]
["借入時充当率((Ｆ+Ｇ+Ｈ)/(Ａ-Ｂ-Ｃ-Ｄ-Ｅ)×100)",null,null,null,null,null,null,"(％)",{"$f":"IF(I31>0,(I24+I25+I26)/(I17-I20-I21-I22-I23),\"\")","v":""},null,null,{"$f":"IF(L31>0,(L24+L25+L26)/(L17-L20-L21-L22-L23),\"\")","v":""},null,null,{"$f":"IF(O31>0,(O24+O25+O26)/(O17-O20-O21-O23),\"\")","v":""},null,null,null,"起債対象\n事 務 費",null,null,"（補助事業分）",null,null,null,null,null,null,null,null,null,null,null,null,null,null,null,null,null,null,"■適正必要額（交通）"]
["基準充当率",null,null,null,null,null,null,"(％)",null,null,null,null,null,null,null,null,null,null,null,null,null,"（単独事業分）",null,null,null,null,null,null,null,null,null,null,null,null,null,null,null,null,null,null,"■補助事業と同様の計算方法により算出した範囲内の額（災害復旧）"]
["起債に関する\n予算の定め",null,"年度",null,null,null,null,null,"会計名",null,null,null,null,null,null,null,null,"議決等年月日",null,null,null,null,null,null,null,"（□","議決済",null,"□","議決予定",null,"□","専決済",null,"□","専決予定）",null,null,null,null,"■実績等に応じ、必要な額"]
[null,null,"起債の目的",null,null,null,"起債限度額（うち財政融資資金）",null,null,null,null,null,"起債の方法",null,null,null,null,null,"利率",null,null,null,null,null,"償還の方法"]
[null,null,null,null,null,null,null,null,null,null,null,null,"□","証書借入",null,"□","普通貸借",null,null,"年利",null,null,"％以内",null,"□","年賦",null,"□","半年賦",null,"□","元利均等",null,"□","元金均等",null,null,null,null,null,"有"]
[null,null,null,null,null,null,null,null,null,null,null,"千円","□","証券発行",null,null,null,null,null,null,null,null,"利率見直しに関する ",null,"□","融資条件による",null,null,null,null,"□","その他（",null,null,null,null,null,"）",null,null,"無"]
[null,null,null,null,null,null," （うち",null,null,null,null,"千円)","□","その他（　　　　　　）",null,null,null,null,null,null,null,null,"但し書きの有無：",null,"□","償還期間：",null,null,null,"年（うち据置期間：",null,null,null,null,"年）"]
["起債同意\n（許可）",null,null,"年月日（予定）",null,null,"同意（許可）額",null,null,null,null,"うち本件借入分",null,null,null,"償還年限",null,null,"うち据置期間",null,null,"備考",null,null,null,null,null,null,null,"地方長期資金等借入申込み償還期限等",null,null,null,null,null,null,null,null,null,null,"（□"]
[null,null,"①",null,null,null,null,null,null,null,"千円",null,null,null,"千円",null,null,"年",null,null,"年",null,null,null,null,null,null,null,null,null,"償還期限：",null,null,null,"年",null,null,null,null,null,"（■"]
[null,null,"②",null,null,null,null,null,null,null,"千円",null,null,null,"千円",null,null,"年",null,null,"年",null,null,null,null,null,null,null,null,null,"うち据置期間：",null,null,null,"年",null,null,null,null,null,"□"]
[null,null,"③",null,null,null,null,null,null,null,"千円",null,null,null,"千円",null,null,"年",null,null,"年",null,null,null,null,null,null,null,null,null,null,null,null,null,null,null,null,null,null,null,"■"]
[null,null,"④",null,null,null,null,null,null,null,"千円",null,null,null,"千円",null,null,"年",null,null,"年"]
["その他参考",null,null,null,null,null,null,null,null,null,null,null,null,null,null,null,null,null,null,null,null,null,null,null,null,null,null,null,null,null,null,null,null,null,null,null,null,null,null,null,"（予定）"]
[null,"①借入額の算出式",null,null,null,null,null,null,null,null,null,null,null,null,"②借入に係る振込口座変更の要否",null,null,null,null,null,null,null,"③貸付日時点における事業の進捗状況"]
[null,"　　≪補助分≫",null,null,null,null,null,null,null,null,null,null,null,null,"　要　　/　　否",null,null,null,null,null,null,null,null,null,null,null,null,null,null,null,null,null,null,null,null,null,null,null,null,null,"要"]
[null,"　　≪単独分≫",null,null,null,null,null,null,null,null,null,null,null,null,null,null,null,null,null,null,null,null,null,null,null,null,null,null,null,null,null,null,null,null,null,null,null,null,null,null,"否"]
[]
[]
["備考"]
[null,"1．用紙の大きさは、日本産業規格Ａ列４とする。"]
[null,"2．事業費内訳には、起債対象となる費用のみ記入する。"]
[null,"3．収支金額、収支状況の各計は一致する。"]
[null,"4．収支状況は、借入月を「　月」欄に記入する。"]
[]
[]
[null,null,null,null,null,null,null,null,{"$f":"IF(I$31=I$17,\"ok\",\"ng\")","v":"ok"},null,null,{"$f":"IF(L$31=L$17,\"ok\",\"ng\")","v":"ok"},null,null,{"$f":"IF(O$31=O$17,\"ok\",\"ng\")","v":"ok"},null,null,null,{"$f":"IF(S$31=S$17,\"ok\",\"ng\")","v":"ok"},null,null,null,{"$f":"IF(W$31=W$17,\"ok\",\"ng\")","v":"ok"},null,null,null,{"$f":"IF(AA$31=AA$17,\"ok\",\"ng\")","v":"ok"},null,null,null,{"$f":"IF(AE$31=AE$17,\"ok\",\"ng\")","v":"ok"},null,null,null,{"$f":"IF(AI$31=AI$17,\"ok\",\"ng\")","v":"ok"}]

{"sheet":"end","index":6,"n_rows":0,"n_cols":0,"rows_kept":0,"cut":false,"hidden":false,"merged":[]}

{"sheet":"総括表","index":7,"n_rows":57,"n_cols":41,"rows_kept":57,"cut":false,"hidden":false,"merged":[[46,1,46,12],[48,26,48,37],[56,8,56,10],[56,11,56,13],[56,14,56,17],[56,18,56,21],[56,22,56,25],[56,26,56,29],[56,30,56,33],[56,34,56,37],[38,29,38,37],[39,3,39,4],[39,6,39,9],[39,11,39,13],[39,15,39,16],[39,18,39,19],[39,21,39,28],[39,30,39,32],[42,3,42,4],[42,6,42,9],[42,11,42,13],[42,15,42,16],[42,18,42,19],[42,21,42,28],[40,18,40,19],[40,21,40,28],[41,3,41,4],[41,6,41,9],[41,11,41,13],[41,15,41,16],[41,18,41,19],[41,21,41,28],[37,6,37,7],[37,8,37,10],[37,13,37,17],[37,25,37,27],[38,0,42,1],[38,3,38,5],[38,6,38,10],[38,11,38,14],[38,15,38,17],[38,18,38,20],[40,3,40,4],[40,6,40,9],[40,11,40,13],[40,15,40,16],[38,21,38,28],[30,30,30,33],[30,34,30,37],[31,0,31,6],[31,8,31,10],[31,11,31,13],[31,14,31,17],[31,18,32,20],[31,21,31,23],[31,24,31,37],[32,0,32,6],[32,8,32,10],[32,11,32,13],[32,14,32,17],[32,21,32,23],[32,24,32,37],[30,0,30,7],[30,8,30,10],[30,11,30,13],[30,14,30,17],[30,18,30,21],[30,22,30,25],[30,26,30,29],[33,0,37,1],[33,2,33,3],[33,4,33,7],[33,8,33,9],[33,10,33,16],[33,17,33,19],[33,20,33,24],[34,2,34,5],[34,6,34,11],[34,12,34,17],[34,18,34,23],[34,24,34,37],[35,2,37,5],[35,8,35,10],[35,20,35,21],[36,8,36,10],[36,33,36,36],[28,34,28,37],[29,0,29,2],[29,3,29,7],[29,8,29,10],[29,11,29,13],[29,14,29,17],[29,18,29,21],[29,22,29,25],[29,26,29,29],[29,30,29,33],[29,34,29,37],[28,0,28,2],[28,3,28,7],[28,8,28,10],[28,11,28,13],[28,14,28,17],[28,18,28,21],[28,22,28,25],[28,26,28,29],[28,30,28,33],[26,30,26,33],[26,34,26,37],[27,0,27,2],[27,3,27,7],[27,8,27,10],[27,11,27,13],[27,14,27,17],[27,18,27,21],[27,22,27,25],[27,26,27,29],[27,30,27,33],[27,34,27,37],[26,0,26,2],[26,3,26,7],[26,8,26,10],[26,11,26,13],[26,14,26,17],[26,18,26,21],[26,22,26,25],[23,0,25,0],[26,26,26,29],[24,26,24,29],[24,30,24,33],[24,34,24,37],[25,1,25,2],[25,3,25,6],[25,8,25,10],[25,11,25,13],[25,14,25,17],[25,18,25,21],[25,22,25,25],[24,3,24,6],[24,8,24,10],[24,11,24,13],[24,14,24,17],[24,18,24,21],[24,22,24,25],[23,1,24,2],[23,3,23,6],[23,8,23,10],[23,11,23,13],[25,26,25,29],[25,30,25,33],[25,34,25,37],[21,34,21,37],[22,1,22,2],[22,3,22,6],[22,8,22,10],[22,11,22,13],[22,14,22,17],[23,14,23,17],[23,18,23,21],[23,22,23,25],[23,26,23,29],[23,30,23,33],[23,34,23,37],[22,18,22,21],[22,22,22,25],[22,26,22,29],[22,30,22,33],[22,34,22,37],[19,34,19,37],[20,1,20,2],[20,3,20,6],[20,8,20,10],[20,11,20,13],[20,14,20,17],[20,18,20,21],[20,22,20,25],[20,26,20,29],[20,30,20,33],[20,34,20,37],[19,0,22,0],[19,1,19,2],[19,3,19,6],[19,8,19,10],[19,11,19,13],[19,14,19,17],[18,22,18,25],[18,26,18,29],[18,30,18,31],[19,18,19,21],[19,22,19,25],[19,26,19,29],[19,30,19,33],[21,1,21,2],[21,3,21,6],[21,8,21,10],[21,11,21,13],[21,14,21,17],[21,18,21,21],[21,22,21,25],[21,26,21,29],[21,30,21,33],[18,32,18,33],[18,34,18,35],[18,36,18,37],[18,0,18,2],[18,3,18,7],[18,8,18,10],[18,11,18,13],[18,14,18,17],[18,18,18,21],[17,0,17,7],[17,8,17,25],[17,26,17,37],[15,22,15,25],[15,26,15,29],[15,30,15,33],[15,34,15,37],[16,0,16,6],[16,8,16,10],[16,11,16,13],[16,14,16,17],[16,18,16,21],[16,22,16,25],[15,0,15,3],[15,4,15,7],[15,8,15,10],[15,11,15,13],[15,14,15,17],[15,18,15,21],[16,26,16,29],[16,30,16,33],[16,34,16,37],[13,34,13,37],[14,0,14,3],[14,4,14,7],[14,8,14,10],[14,11,14,13],[14,14,14,17],[14,18,14,21],[14,22,14,25],[14,26,14,29],[14,30,14,33],[14,34,14,37],[13,0,13,3],[13,4,13,7],[13,8,13,10],[13,11,13,13],[13,14,13,17],[13,18,13,21],[13,22,13,25],[13,26,13,29],[13,30,13,33],[11,22,11,25],[11,26,11,29],[11,30,11,33],[11,34,11,37],[12,0,12,3],[12,4,12,7],[12,8,12,10],[12,11,12,13],[12,14,12,17],[12,18,12,21],[12,22,12,25],[12,26,12,29],[12,30,12,33],[12,34,12,37],[9,0,10,3],[9,4,10,7],[9,8,9,25],[9,26,9,37],[10,8,10,10],[10,11,10,13],[10,14,10,17],[10,18,10,21],[10,22,10,25],[10,26,10,29],[0,28,0,37],[1,4,1,32],[1,33,1,37],[3,0,3,1],[3,2,3,21],[3,22,3,25],[3,28,3,29],[3,30,3,31],[3,32,3,33],[3,34,3,35],[44,1,44,4],[44,14,44,21],[45,1,45,12],[45,14,45,21],[44,22,44,33],[45,22,45,33],[4,0,4,1],[4,2,4,21],[4,22,4,29],[4,30,4,37],[5,0,8,1],[5,2,8,21],[5,22,8,29],[5,30,8,37],[10,30,10,31],[10,32,10,33],[10,34,10,35],[10,36,10,37],[11,0,11,3],[11,4,11,7],[11,8,11,10],[11,11,11,13],[11,14,11,17],[11,18,11,21]]}
["別紙第13号書式"]
[null,null,null,null,"事　業　実　施　状　況　等　調　書"]
[]
["事業名",null,null,null,null,null,null,null,null,null,null,null,null,null,null,null,null,null,null,null,null,null,"計画期間",null,null,null,null,null,null,null,"年度～",null,null,null,"年度"]
["施行場所",null,null,null,null,null,null,null,null,null,null,null,null,null,null,null,null,null,null,null,null,null,"前年度以前施行済事業",null,null,null,null,null,null,null,"翌年度以降計画事業"]
["事業概要"]
[]
[]
[]
["事　業　費　内　訳",null,null,null,"事業開始日～\n事業完成(見込)日",null,null,null,"支出金額（単位：千円）",null,null,null,null,null,null,null,null,null,null,null,null,null,null,null,null,null,"支　出　状　況"]
[null,null,null,null,null,null,null,null,null,null,null,"（補助事業分）",null,null,"（単独事業分）",null,null,null,"決算額",null,null,null,"繰越額",null,null,null,"前月まで",null,null,null,null,null,"月",null,null,null,"月以降"]
[null,null,null,null,null,null,null,null,{"$f":"SUM(start:end!I12)","v":0},null,null,{"$f":"SUM(start:end!L12)","v":0},null,null,{"$f":"SUM(start:end!O12)","v":0},null,null,null,{"$f":"SUM(start:end!S12)","v":0},null,null,null,{"$f":"SUM(start:end!W12)","v":0},null,null,null,{"$f":"SUM(start:end!AA12)","v":0},null,null,null,{"$f":"SUM(start:end!AE12)","v":0},null,null,null,{"$f":"SUM(start:end!AI12)","v":0}]
[null,null,null,null,null,null,null,null,{"$f":"SUM(start:end!I13)","v":0},null,null,{"$f":"SUM(start:end!L13)","v":0},null,null,{"$f":"SUM(start:end!O13)","v":0},null,null,null,{"$f":"SUM(start:end!S13)","v":0},null,null,null,{"$f":"SUM(start:end!W13)","v":0},null,null,null,{"$f":"SUM(start:end!AA13)","v":0},null,null,null,{"$f":"SUM(start:end!AE13)","v":0},null,null,null,{"$f":"SUM(start:end!AI13)","v":0}]
[null,null,null,null,null,null,null,null,{"$f":"SUM(start:end!I14)","v":0},null,null,{"$f":"SUM(start:end!L14)","v":0},null,null,{"$f":"SUM(start:end!O14)","v":0},null,null,null,{"$f":"SUM(start:end!S14)","v":0},null,null,null,{"$f":"SUM(start:end!W14)","v":0},null,null,null,{"$f":"SUM(start:end!AA14)","v":0},null,null,null,{"$f":"SUM(start:end!AE14)","v":0},null,null,null,{"$f":"SUM(start:end!AI14)","v":0}]
[null,null,null,null,null,null,null,null,{"$f":"SUM(start:end!I15)","v":0},null,null,{"$f":"SUM(start:end!L15)","v":0},null,null,{"$f":"SUM(start:end!O15)","v":0},null,null,null,{"$f":"SUM(start:end!S15)","v":0},null,null,null,{"$f":"SUM(start:end!W15)","v":0},null,null,null,{"$f":"SUM(start:end!AA15)","v":0},null,null,null,{"$f":"SUM(start:end!AE15)","v":0},null,null,null,{"$f":"SUM(start:end!AI15)","v":0}]
[null,null,null,null,null,null,null,null,{"$f":"SUM(start:end!I16)","v":0},null,null,{"$f":"SUM(start:end!L16)","v":0},null,null,{"$f":"SUM(start:end!O16)","v":0},null,null,null,{"$f":"SUM(start:end!S16)","v":0},null,null,null,{"$f":"SUM(start:end!W16)","v":0},null,null,null,{"$f":"SUM(start:end!AA16)","v":0},null,null,null,{"$f":"SUM(start:end!AE16)","v":0},null,null,null,{"$f":"SUM(start:end!AI16)","v":0}]
["計",null,null,null,null,null,null,"Ａ",{"$f":"SUM(I12:K16)","v":0},null,null,{"$f":"SUM(L12:N16)","v":0},null,null,{"$f":"SUM(O12:R16)","v":0},null,null,null,{"$f":"SUM(S12:V16)","v":0},null,null,null,{"$f":"SUM(W12:Z16)","v":0},null,null,null,{"$f":"SUM(AA12:AD16)","v":0},null,null,null,{"$f":"SUM(AE12:AH16)","v":0},null,null,null,{"$f":"SUM(AI12:AL16)","v":0}]
["財　源　内　訳",null,null,null,null,null,null,null,"収入金額（単位：千円）",null,null,null,null,null,null,null,null,null,null,null,null,null,null,null,null,null,"収　入　状　況"]
["項　目",null,null,"内　容",null,null,null,null,null,null,null,"（補助事業分）",null,null,"（単独事業分）",null,null,null,"決算額",null,null,null,"繰越額",null,null,null,"前月まで",null,null,null,null,null,"月",null,null,null,"月以降"]
["控除財源","国庫支出金",null,null,null,null,null,"Ｂ",{"$f":"SUM(start:end!I20)","v":0},null,null,{"$f":"SUM(start:end!L20)","v":0},null,null,{"$f":"SUM(start:end!O20)","v":0},null,null,null,{"$f":"SUM(start:end!S20)","v":0},null,null,null,{"$f":"SUM(start:end!W20)","v":0},null,null,null,{"$f":"SUM(start:end!AA20)","v":0},null,null,null,{"$f":"SUM(start:end!AE20)","v":0},null,null,null,{"$f":"SUM(start:end!AI20)","v":0},null,null,null,null,null,"■該当なし（事務費を起債対象とせず）"]
[null,"都道府県支出金",null,null,null,null,null,"Ｃ",{"$f":"SUM(start:end!I21)","v":0},null,null,{"$f":"SUM(start:end!L21)","v":0},null,null,{"$f":"SUM(start:end!O21)","v":0},null,null,null,{"$f":"SUM(start:end!S21)","v":0},null,null,null,{"$f":"SUM(start:end!W21)","v":0},null,null,null,{"$f":"SUM(start:end!AA21)","v":0},null,null,null,{"$f":"SUM(start:end!AE21)","v":0},null,null,null,{"$f":"SUM(start:end!AI21)","v":0},null,null,null,null,null,"■工事費の5.0％以内の額"]
[null,null,null,null,null,null,null,"Ｄ",{"$f":"SUM(start:end!I22)","v":0},null,null,{"$f":"SUM(start:end!L22)","v":0},null,null,{"$f":"SUM(start:end!O22)","v":0},null,null,null,{"$f":"SUM(start:end!S22)","v":0},null,null,null,{"$f":"SUM(start:end!W22)","v":0},null,null,null,{"$f":"SUM(start:end!AA22)","v":0},null,null,null,{"$f":"SUM(start:end!AE22)","v":0},null,null,null,{"$f":"SUM(start:end!AI22)","v":0},null,null,null,null,null,"■廃止前の補助基準により定められていた計算方法により算出した範囲内の額"]
[null,null,null,null,null,null,null,"Ｅ",{"$f":"SUM(start:end!I23)","v":0},null,null,{"$f":"SUM(start:end!L23)","v":0},null,null,{"$f":"SUM(start:end!O23)","v":0},null,null,null,{"$f":"SUM(start:end!S23)","v":0},null,null,null,{"$f":"SUM(start:end!W23)","v":0},null,null,null,{"$f":"SUM(start:end!AA23)","v":0},null,null,null,{"$f":"SUM(start:end!AE23)","v":0},null,null,null,{"$f":"SUM(start:end!AI23)","v":0},null,null,null,null,null,"■補助基準に定める範囲内の事務費"]
["起債","財政融資資金",null,"本債",null,null,null,"Ｆ",{"$f":"SUM(start:end!I24)","v":0},null,null,{"$f":"SUM(start:end!L24)","v":0},null,null,{"$f":"SUM(start:end!O24)","v":0},null,null,null,{"$f":"SUM(start:end!S24)","v":0},null,null,null,{"$f":"SUM(start:end!W24)","v":0},null,null,null,{"$f":"SUM(start:end!AA24)","v":0},null,null,null,{"$f":"SUM(start:end!AE24)","v":0},null,null,null,{"$f":"SUM(start:end!AI24)","v":0}]
[null,null,null,null,null,null,null,"Ｇ",{"$f":"SUM(start:end!I25)","v":0},null,null,{"$f":"SUM(start:end!L25)","v":0},null,null,{"$f":"SUM(start:end!O25)","v":0},null,null,null,{"$f":"SUM(start:end!S25)","v":0},null,null,null,{"$f":"SUM(start:end!W25)","v":0},null,null,null,{"$f":"SUM(start:end!AA25)","v":0},null,null,null,{"$f":"SUM(start:end!AE25)","v":0},null,null,null,{"$f":"SUM(start:end!AI25)","v":0},null,null,null,null,null,"■該当なし（事務費を起債対象とせず）"]
[null,"その他",null,null,null,null,null,"Ｈ",{"$f":"SUM(start:end!I26)","v":0},null,null,{"$f":"SUM(start:end!L26)","v":0},null,null,{"$f":"SUM(start:end!O26)","v":0},null,null,null,{"$f":"SUM(start:end!S26)","v":0},null,null,null,{"$f":"SUM(start:end!W26)","v":0},null,null,null,{"$f":"SUM(start:end!AA26)","v":0},null,null,null,{"$f":"SUM(start:end!AE26)","v":0},null,null,null,{"$f":"SUM(start:end!AI26)","v":0},null,null,null,null,null,"■設計監督費（外部委託）について、実所要額"]
["一般財源",null,null,null,null,null,null,null,{"$f":"SUM(start:end!I27)","v":0},null,null,{"$f":"SUM(start:end!L27)","v":0},null,null,{"$f":"SUM(start:end!O27)","v":0},null,null,null,{"$f":"SUM(start:end!S27)","v":0},null,null,null,{"$f":"SUM(start:end!W27)","v":0},null,null,null,{"$f":"SUM(start:end!AA27)","v":0},null,null,null,{"$f":"SUM(start:end!AE27)","v":0},null,null,null,{"$f":"SUM(start:end!AI27)","v":0},null,null,null,null,null,"■設計監督費（外部委託せず）について、全体事業費の2.75％以内の額"]
[null,null,null,null,null,null,null,null,{"$f":"SUM(start:end!I28)","v":0},null,null,{"$f":"SUM(start:end!L28)","v":0},null,null,{"$f":"SUM(start:end!O28)","v":0},null,null,null,{"$f":"SUM(start:end!S28)","v":0},null,null,null,{"$f":"SUM(start:end!W28)","v":0},null,null,null,{"$f":"SUM(start:end!AA28)","v":0},null,null,null,{"$f":"SUM(start:end!AE28)","v":0},null,null,null,{"$f":"SUM(start:end!AI28)","v":0},null,null,null,null,null,"■設計監督費以外の事務費について、全体事業費の2.75％以内の額"]
[null,null,null,null,null,null,null,null,{"$f":"SUM(start:end!I29)","v":0},null,null,{"$f":"SUM(start:end!L29)","v":0},null,null,{"$f":"SUM(start:end!O29)","v":0},null,null,null,{"$f":"SUM(start:end!S29)","v":0},null,null,null,{"$f":"SUM(start:end!W29)","v":0},null,null,null,{"$f":"SUM(start:end!AA29)","v":0},null,null,null,{"$f":"SUM(start:end!AE29)","v":0},null,null,null,{"$f":"SUM(start:end!AI29)","v":0},null,null,null,null,null,"■設計監督費（外部委託）の実所要額、及びそれ以外の事務費について全体事業費の2.75％以内の額"]
["一時立替金",null,null,null,null,null,null,null,{"$f":"SUM(start:end!I30)","v":0},null,null,{"$f":"SUM(start:end!L30)","v":0},null,null,{"$f":"SUM(start:end!O30)","v":0},null,null,null,{"$f":"SUM(start:end!S30)","v":0},null,null,null,{"$f":"SUM(start:end!W30)","v":0},null,null,null,{"$f":"SUM(start:end!AA30)","v":0},null,null,null,{"$f":"SUM(start:end!AE30)","v":0},null,null,null,{"$f":"SUM(start:end!AI30)","v":0},null,null,null,null,null,"■設計監督費（外部委託せず）及びそれ以外の事務費について、それぞれ全体事業費の2.75％以内の額　"]
["計",null,null,null,null,null,null,null,{"$f":"SUM(I20:K30)","v":0},null,null,{"$f":"SUM(L20:N30)","v":0},null,null,{"$f":"SUM(O20:R30)","v":0},null,null,null,{"$f":"SUM(S20:V30)","v":0},null,null,null,{"$f":"SUM(W20:Z30)","v":0},null,null,null,{"$f":"SUM(AA20:AD30)","v":0},null,null,null,{"$f":"SUM(AE20:AH30)","v":0},null,null,null,{"$f":"SUM(AI20:AL30)","v":0},null,null,null,null,null,"■設計監督費と合わせて全体事業費の6.0％以内の額（水道、港湾、下水道）"]
["借入時充当率((Ｆ+Ｇ+Ｈ)/(Ａ-Ｂ-Ｃ-Ｄ-Ｅ)×100)",null,null,null,null,null,null,"(％)",{"$f":"IF(I31>0,(I24+I25+I26)/(I17-I20-I21-I22-I23),\"\")","v":""},null,null,{"$f":"IF(L31>0,(L24+L25+L26)/(L17-L20-L21-L22-L23),\"\")","v":""},null,null,{"$f":"IF(O31>0,(O24+O25+O26)/(O17-O20-O21-O23),\"\")","v":""},null,null,null,"起債対象\n事 務 費",null,null,"（補助事業分）",null,null,null,null,null,null,null,null,null,null,null,null,null,null,null,null,null,null,"■適正必要額（交通）"]
["基準充当率",null,null,null,null,null,null,"(％)",null,null,null,null,null,null,null,null,null,null,null,null,null,"（単独事業分）",null,null,null,null,null,null,null,null,null,null,null,null,null,null,null,null,null,null,"■補助事業と同様の計算方法により算出した範囲内の額（災害復旧）"]
["起債に関する\n予算の定め",null,"年度",null,null,null,null,null,"会計名",null,null,null,null,null,null,null,null,"議決等年月日",null,null,null,null,null,null,null,"（□","議決済",null,"□","議決予定",null,"□","専決済",null,"□","専決予定）",null,null,null,null,"■実績等に応じ、必要な額"]
[null,null,"起債の目的",null,null,null,"起債限度額（うち財政融資資金）",null,null,null,null,null,"起債の方法",null,null,null,null,null,"利率",null,null,null,null,null,"償還の方法"]
[null,null,null,null,null,null,null,null,null,null,null,null,"□","証書借入",null,"□","普通貸借",null,null,"年利",null,null,"％以内",null,"□","年賦",null,"□","半年賦",null,"□","元利均等",null,"□","元金均等",null,null,null,null,null,"有"]
[null,null,null,null,null,null,null,null,null,null,null,"千円","□","証券発行",null,null,null,null,null,null,null,null,"利率見直しに関する ",null,"□","融資条件による",null,null,null,null,"□","その他（",null,null,null,null,null,"）",null,null,"無"]
[null,null,null,null,null,null," （うち",null,null,null,null,"千円)","□","その他（　　　　　　）",null,null,null,null,null,null,null,null,"但し書きの有無：",null,"□","償還期間：",null,null,null,"年（うち据置期間：",null,null,null,null,"年）"]
["起債同意\n（許可）",null,null,"年月日（予定）",null,null,"同意（許可）額",null,null,null,null,"うち本件借入分",null,null,null,"償還年限",null,null,"うち据置期間",null,null,"備考",null,null,null,null,null,null,null,"地方長期資金等借入申込み償還期限等",null,null,null,null,null,null,null,null,null,null,"（□"]
[null,null,"①",null,null,null,null,null,null,null,"千円",null,null,null,"千円",null,null,"年",null,null,"年",null,null,null,null,null,null,null,null,null,"償還期限：",null,null,null,"年",null,null,null,null,null,"（■"]
[null,null,"②",null,null,null,null,null,null,null,"千円",null,null,null,"千円",null,null,"年",null,null,"年",null,null,null,null,null,null,null,null,null,"うち据置期間：",null,null,null,"年",null,null,null,null,null,"□"]
[null,null,"③",null,null,null,null,null,null,null,"千円",null,null,null,"千円",null,null,"年",null,null,"年",null,null,null,null,null,null,null,null,null,null,null,null,null,null,null,null,null,null,null,"■"]
[null,null,"④",null,null,null,null,null,null,null,"千円",null,null,null,"千円",null,null,"年",null,null,"年"]
["その他参考",null,null,null,null,null,null,null,null,null,null,null,null,null,null,null,null,null,null,null,null,null,null,null,null,null,null,null,null,null,null,null,null,null,null,null,null,null,null,null,"（予定）"]
[null,"①借入額の算出式",null,null,null,null,null,null,null,null,null,null,null,null,"②借入に係る振込口座変更の要否",null,null,null,null,null,null,null,"③貸付日時点における事業の進捗状況"]
[null,"　　≪補助分≫",null,null,null,null,null,null,null,null,null,null,null,null,"　要　　/　　否",null,null,null,null,null,null,null,null,null,null,null,null,null,null,null,null,null,null,null,null,null,null,null,null,null,"要"]
[null,"　　≪単独分≫",null,null,null,null,null,null,null,null,null,null,null,null,null,null,null,null,null,null,null,null,null,null,null,null,null,null,null,null,null,null,null,null,null,null,null,null,null,null,"否"]
[]
[]
["備考"]
[null,"1．用紙の大きさは、日本産業規格Ａ列４とする。"]
[null,"2．事業費内訳には、起債対象となる費用のみ記入する。"]
[null,"3．収支金額、収支状況の各計は一致する。"]
[null,"4．収支状況は、借入月を「　月」欄に記入する。"]
[]
[]
[null,null,null,null,null,null,null,null,{"$f":"IF(I$31=I$17,\"ok\",\"ng\")","v":"ok"},null,null,{"$f":"IF(L$31=L$17,\"ok\",\"ng\")","v":"ok"},null,null,{"$f":"IF(O$31=O$17,\"ok\",\"ng\")","v":"ok"},null,null,null,{"$f":"IF(S$31=S$17,\"ok\",\"ng\")","v":"ok"},null,null,null,{"$f":"IF(W$31=W$17,\"ok\",\"ng\")","v":"ok"},null,null,null,{"$f":"IF(AA$31=AA$17,\"ok\",\"ng\")","v":"ok"},null,null,null,{"$f":"IF(AE$31=AE$17,\"ok\",\"ng\")","v":"ok"},null,null,null,{"$f":"IF(AI$31=AI$17,\"ok\",\"ng\")","v":"ok"}]

{"sheet":"リスト","index":8,"n_rows":824,"n_cols":3,"rows_kept":824,"cut":false,"hidden":true,"merged":[]}
[null,"貸付先コード","団体名"]
[null,50000,"大阪府"]
[null,500001,"大阪府（企業局）"]
[null,500002,"大阪府（病院）"]
[null,500003,"大阪府（中宮病院）"]
[null,500004,"大阪府（羽曳野病院）"]
[null,500005,"大阪府（府立成人病センタ－）"]
[null,500006,"大阪府（中央卸売市場）"]
[null,500007,"大阪府（母子医療センタ－）"]
[null,500008,"大阪府（上水道出資債）"]
[null,"50000A","大阪府（流域下水道）"]
[null,50001,"大阪市"]
[null,500010,"大阪市（水道）"]
[null,500011,"大阪市（交通）"]
[null,500012,"大阪市（水道出資債）"]
[null,500013,"大阪市（交通出資債）"]
[null,50002,"堺市"]
[null,500020,"堺市（水道）"]
[null,500022,"堺市（下水道）"]
[null,50012,"岸和田市"]
[null,500120,"岸和田市（水道）"]
[null,500121,"岸和田市（水道出資債）"]
[null,500122,"岸和田市（病院）"]
[null,500123,"岸和田市（下水道）"]
[null,50013,"豊中市"]
[null,500130,"豊中市（上水道）"]
[null,500131,"豊中市（病院）"]
[null,500132,"豊中市（上水道出資債）"]
[null,500133,"豊中市（下水道）"]
[null,50015,"池田市"]
[null,500150,"池田市（水道）"]
[null,500151,"池田市（水道出資債）"]
[null,500152,"池田市（下水道）"]
[null,500153,"池田市（病院）"]
[null,50016,"吹田市"]
[null,500160,"吹田市（上水道）"]
[null,500162,"吹田市（下水道）"]
[null,500163,"吹田市（病院）"]
[null,50017,"泉大津市"]
[null,500170,"泉大津市（上水道）"]
[null,500171,"泉大津市（下水道）"]
[null,500172,"泉大津市（病院）"]
[null,50018,"高槻市"]
[null,500180,"高槻市（水道）"]
[null,500181,"高槻市（交通）"]
[null,500182,"高槻市（水道出資債）"]
[null,500183,"高槻市（下水道）"]
[null,50019,"貝塚市"]
[null,500190,"貝塚市（水道）"]
[null,500191,"貝塚市（病院）"]
[null,500192,"貝塚市（水道出資債）"]
[null,50020,"守口市"]
[null,500200,"守口市（上水道）"]
[null,500201,"守口市（上水道出資債）"]
[null,500202,"守口市（下水道）"]
[null,50021,"枚方市"]
[null,500210,"枚方市（水道）"]
[null,500212,"枚方市（病院）"]
[null,500213,"枚方市（下水道）"]
[null,50022,"茨木市"]
[null,500220,"茨木市（水道）"]
[null,500221,"茨木市（水道出資債）"]
[null,500222,"茨木市（下水道）"]
[null,50023,"八尾市"]
[null,500230,"八尾市（水道）"]
[null,500231,"八尾市（出資債）"]
[null,50024,"泉佐野市"]
[null,500240,"泉佐野市（水道）"]
[null,500241,"泉佐野市（病院）"]
[null,500242,"泉佐野市（水道出資債）"]
[null,500243,"泉佐野市（下水道）"]
[null,50025,"富田林市"]
[null,500250,"富田林市（水道）"]
[null,500251,"富田林市（下水道）"]
[null,50026,"寝屋川市"]
[null,500260,"寝屋川市（水道）"]
[null,500261,"寝屋川市（水道出資債）"]
[null,500262,"寝屋川市（下水道）"]
[null,50027,"河内長野市"]
[null,500270,"河内長野市（水道）"]
[null,500271,"河内長野市（水道出資債）"]
[null,500272,"河内長野市（下水道）"]
[null,50030,"松原市"]
[null,500300,"松原市（水道）"]
[null,500301,"松原市（水道出資債）"]
[null,50031,"大東市"]
[null,500310,"大東市（水道）"]
[null,500311,"大東市（水道出資債）"]
[null,500312,"大東市（下水道）"]
[null,50032,"和泉市"]
[null,500320,"和泉市（上水道）"]
[null,500321,"和泉市（病院）"]
[null,500322,"和泉市（上水道出資債）"]
[null,500323,"和泉市（下水道）"]
[null,50033,"箕面市"]
[null,500330,"箕面市（水道）"]
[null,500331,"箕面市（水道出資債）"]
[null,500332,"箕面市（下水道）"]
[null,500333,"箕面市（箕面市立病院）"]
[null,50034,"柏原市"]
[null,500340,"柏原市（水道）"]
[null,500341,"柏原市（水道出資債）"]
[null,500342,"柏原市（下水道）"]
[null,500343,"柏原市（病院）"]
[null,50035,"羽曳野市"]
[null,500352,"羽曳野市（下水道）"]
[null,50036,"門真市"]
[null,500360,"門真市（上水道）"]
[null,500361,"門真市（上水道出資債）"]
[null,500362,"門真市（公共下水道）"]
[null,50037,"摂津市"]
[null,500370,"摂津市（上水道）"]
[null,500371,"摂津市（上水道出資債）"]
[null,500372,"摂津市（下水道）"]
[null,50038,"藤井寺市"]
[null,500380,"藤井寺市（上水道）"]
[null,500381,"藤井寺市（上水道出資債）"]
[null,500382,"藤井寺市（病院）"]
[null,500383,"藤井寺市（下水道）"]
[null,50039,"高石市"]
[null,500390,"高石市（上水道）"]
[null,500391,"高石市（下水道）"]
[null,50040,"東大阪市"]
[null,500400,"東大阪市（水道）"]
[null,500401,"東大阪市（水道出資債）"]
[null,500402,"東大阪市（下水道）"]
[null,500403,"東大阪市（病院）"]
[null,50041,"四條畷市"]
[null,500410,"四條畷市（上水道）"]
[null,500411,"四條畷市（下水道）"]
[null,500412,"四條畷市（上水道出資債）"]
[null,50042,"泉南市"]
[null,500420,"泉南市（水道）"]
[null,50043,"交野市"]
[null,500430,"交野市（水道）"]
[null,500431,"交野市（水道出資債）"]
[null,50044,"大阪狭山市"]
[null,500440,"大阪狭山市（水道）"]
[null,500441,"大阪狭山市（水道出資債）"]
[null,500442,"大阪狭山市（下水道）"]
[null,50045,"阪南市"]
[null,500450,"阪南市（上水道）"]
[null,500451,"阪南市（病院）"]
[null,500452,"阪南市（下水道）"]
[null,50100,"島本町"]
[null,501000,"島本町（上水道）"]
[null,50106,"豊能町"]
[null,501060,"豊能町（上水道）"]
[null,50109,"能勢町"]
[null,50118,"太子町"]
[null,50121,"河南町"]
[null,50124,"千早赤阪村"]
[null,501240,"千早赤阪村（直診）"]
[null,501241,"千早赤阪村（下水道）"]
[null,501242,"千早赤阪村（水道）"]
[null,50139,"忠岡町"]
[null,501390,"忠岡町（病院）"]
[null,501391,"忠岡町（上水道）"]
[null,501392,"忠岡町（下水道）"]
[null,50142,"熊取町"]
[null,501420,"熊取町（上水道）"]
[null,501421,"熊取町（下水道）"]
[null,50145,"田尻町"]
[null,50157,"岬町"]
[null,50556,"大阪広域水道企業団"]
[null,505560,"大阪広域水道企業団（工業用水道）"]
[null,505561,"大阪広域水道企業団（市町村域水道事業）"]
[null,50602,"枚方寝屋川消防組合"]
[null,50605,"泉北環境整備施設組合"]
[null,50606,"長瀬川沿岸下水道組合"]
[null,50608,"泉北水道企業団"]
[null,50610,"豊中市伊丹市クリーンランド"]
[null,50612,"柏羽藤環境事業組合"]
[null,50615,"東大阪都市清掃施設組合"]
[null,50616,"泉佐野市田尻町清掃施設組合"]
[null,50617,"飯盛霊園組合"]
[null,50618,"岸和田市貝塚市清掃施設組合"]
[null,50620,"守口市門真市消防組合"]
[null,50629,"藤井寺市柏原市学校給食組合"]
[null,50633,"泉南清掃事務組合"]
[null,50634,"四條畷市交野市清掃施設組合"]
[null,50635,"高石市泉大津市墓地組合"]
[null,50636,"柏原羽曳野藤井寺消防組合"]
[null,50637,"八尾市柏原市火葬場組合"]
[null,50638,"阪南岬消防組合"]
[null,50640,"北河内４市リサイクル施設組合"]
[null,50641,"南河内環境事業組合"]
[null,50642,"大東四條畷消防組合"]
[null,50643,"大阪市・八尾市・松原市環境施設組合"]
[null,50700,"豊能郡環境施設組合"]
[null,51000,"京都府"]
[null,510000,"京都府（電気）"]
[null,510001,"京都府（水道）"]
[null,510002,"京都府（病院）"]
[null,510003,"京都府（工水）"]
[null,51001,"京都市"]
[null,510010,"京都市（交通）"]
[null,510011,"京都市（下水道）"]
[null,510012,"京都市（上水道）"]
[null,510013,"京都市（高速鉄道）"]
[null,510014,"京都市（上水道一般会計出資債）"]
[null,510015,"京都市（高速鉄道一般会計出資債）"]
[null,510016,"京都市（特環公共下水）"]
[null,510017,"京都市（簡易水道）"]
[null,51011,"福知山市"]
[null,510110,"福知山市（上水道）"]
[null,510112,"福知山市（病院）"]
[null,510113,"福知山市（上水道一般会計出資債）"]
[null,510114,"福知山市（簡易水道）"]
[null,510115,"福知山市（下水道）"]
[null,510116,"福知山市（集落排水）"]
[null,510117,"福知山市（国保診療所）"]
[null,510118,"福知山市（辺地・過疎）"]
[null,51012,"舞鶴市"]
[null,510120,"舞鶴市（上水道）"]
[null,510121,"舞鶴市（病院）"]
[null,51013,"綾部市"]
[null,510130,"綾部市（上水道）"]
[null,510131,"綾部市（病院）"]
[null,51014,"宇治市"]
[null,510140,"宇治市（水道）"]
[null,510141,"宇治市（水道一般会計出資債）"]
[null,510142,"宇治市（下水道）"]
[null,51015,"宮津市"]
[null,510150,"宮津市（上水道）"]
[null,51016,"亀岡市"]
[null,510160,"亀岡市（上水道）"]
[null,510161,"亀岡市（公共下水）"]
[null,510162,"亀岡市（上水道一般会計出資債）"]
[null,510163,"亀岡市（病院）"]
[null,51017,"城陽市"]
[null,510170,"城陽市（上水道）"]
[null,510171,"城陽市（上水道一般会計出資債）"]
[null,510172,"城陽市（下水道）"]
[null,51018,"向日市"]
[null,510180,"向日市（上水道）"]
[null,510181,"向日市（上水道一般会計出資債）"]
[null,51019,"長岡京市"]
[null,510190,"長岡京市（上水道）"]
[null,510191,"長岡京市（上水道一般会計出資債）"]
[null,510192,"長岡京市（公共下水道）"]
[null,51020,"八幡市"]
[null,510200,"八幡市（公営）"]
[null,510201,"八幡市（公営一般会計出資債）"]
[null,510202,"八幡市（下水道）"]
[null,51021,"京田辺市"]
[null,510210,"京田辺市（公共下水道）"]
[null,510211,"京田辺市（農業集落排水）"]
[null,510212,"京田辺市（上水道）"]
[null,51022,"京丹後市"]
[null,510220,"京丹後市（国保診療所）"]
[null,510221,"京丹後市（介護サービス）"]
[null,510222,"京丹後市（簡易水道）"]
[null,510223,"京丹後市（集落排水）"]
[null,510224,"京丹後市（公共下水道）"]
[null,510225,"京丹後市（上水道）"]
[null,510226,"京丹後市（病院）"]
[null,510227,"京丹後市（浄化槽整備）"]
[null,510228,"京丹後市（久美浜病院）"]
[null,510229,"京丹後市（弥栄病院）"]
[null,51023,"南丹市"]
[null,510230,"南丹市（上水道）"]
[null,51024,"木津川市"]
[null,510240,"木津川市（下水道）"]
[null,51106,"大山崎町"]
[null,511060,"大山崎町（上水道）"]
[null,51112,"久御山町"]
[null,511120,"久御山町（水道）"]
[null,511121,"久御山町（下水道）"]
[null,51121,"井手町"]
[null,511210,"井手町（上水道）"]
[null,51124,"宇治田原町"]
[null,511240,"宇治田原町（簡水）"]
[null,511241,"宇治田原町（下水）"]
[null,51136,"笠置町"]
[null,51139,"和束町"]
[null,51142,"精華町"]
[null,51145,"南山城村"]
[null,511450,"南山城村（簡易水道）"]
[null,51170,"京丹波町"]
[null,511700,"京丹波町（病院）"]
[null,511701,"京丹波町（水道）"]
[null,51187,"伊根町"]
[null,51191,"与謝野町"]
[null,511910,"与謝野町（上水道）"]
[null,51602,"国民健康保険南丹病院組合"]
[null,51604,"城南衛生管理組合"]
[null,51606,"乙訓環境衛生組合"]
[null,51607,"乙訓福祉施設事務組合"]
[null,51608,"与謝野町宮津市中学校組合"]
[null,51609,"宮津与謝消防組合"]
[null,51610,"丹後地区広域市町村圏事務組合"]
[null,51611,"乙訓消防組合"]
[null,51612,"船井郡衛生管理組合"]
[null,51613,"国民健康保険山城病院組合"]
[null,51614,"相楽郡広域事務組合"]
[null,51615,"相楽郡西部塵埃処理組合"]
[null,51616,"相楽中部消防組合"]
[null,51691,"京都中部広域消防組合"]
[null,51723,"奥丹後養老施設組合"]
[null,51733,"相楽東部広域連合"]
[null,52000,"兵庫県"]
[null,520000,"兵庫県（病院）"]
[null,520001,"兵庫県（工業用水）"]
[null,520002,"兵庫県（発電）"]
[null,520003,"兵庫県（上水道）"]
[null,520004,"兵庫県（水源開発）"]
[null,520005,"兵庫県（上水出資債）"]
[null,52001,"神戸市"]
[null,520010,"神戸市（上水）"]
[null,520011,"神戸市（上水出資債）"]
[null,520012,"神戸市（工水）"]
[null,520013,"神戸市（都市高速）"]
[null,520014,"神戸市（都市高速出資債）"]
[null,520015,"神戸市（交通）"]
[null,52011,"姫路市"]
[null,520110,"姫路市（上水）"]
[null,520111,"姫路市（上水出資債）"]
[null,520113,"姫路市（下水）"]
[null,52012,"尼崎市"]
[null,520120,"尼崎市（上水道）"]
[null,520121,"尼崎市（工業用水）"]
[null,520122,"尼崎市（自動車運送）"]
[null,520123,"尼崎市（上水出資債）"]
[null,520124,"尼崎市（公共下水道）"]
[null,520125,"尼崎市（流域下水道）"]
[null,52013,"明石市"]
[null,520130,"明石市（上水）"]
[null,520131,"明石市（上水出資債）"]
[null,520133,"明石市（病院）"]
[null,520134,"明石市（下水道）"]
[null,52014,"西宮市"]
[null,520140,"西宮市（上水）"]
[null,520141,"西宮市（上水出資債）"]
[null,520142,"西宮市（工水）"]
[null,520143,"西宮市（病院）"]
[null,520144,"西宮市（下水道）"]
[null,52016,"芦屋市"]
[null,520160,"芦屋市（上水道）"]
[null,520161,"芦屋市（病院）"]
[null,520162,"芦屋市（下水道）"]
[null,52017,"伊丹市"]
[null,520170,"伊丹市（上水道）"]
[null,520171,"伊丹市（病院）"]
[null,520172,"伊丹市（交通）"]
[null,520173,"伊丹市（工業用水道）"]
[null,520174,"伊丹市（上水出資債）"]
[null,520175,"伊丹市（下水道）"]
[null,52018,"相生市"]
[null,520180,"相生市（病院）"]
[null,52020,"加古川市"]
[null,520200,"加古川市（上水）"]
[null,520201,"加古川市（上水出資債）"]
[null,520202,"加古川市（病院）"]
[null,520203,"加古川市（下水道）"]
[null,52022,"赤穂市"]
[null,520220,"赤穂市病院事業"]
[null,520221,"赤穂市（水道）"]
[null,520222,"赤穂市（介護老人保健施設）"]
[null,520223,"赤穂市（下水道）"]
[null,52024,"宝塚市"]
[null,520240,"宝塚市（上水）"]
[null,520241,"宝塚市（上水出資債）"]
[null,520242,"宝塚市（簡水）"]
[null,520243,"宝塚市（病院）"]
[null,520244,"宝塚市（下水道）"]
[null,520245,"宝塚市（国診）"]
[null,52025,"三木市"]
[null,520250,"三木市（病院）"]
[null,520251,"三木市（水道）"]
[null,520252,"三木市（下水道）"]
[null,52026,"高砂市"]
[null,520260,"高砂市（上水道）"]
[null,520261,"高砂市（病院）"]
[null,52027,"川西市"]
[null,520270,"川西市（上水）"]
[null,520271,"川西市（上水出資債）"]
[null,520272,"川西市（病院）"]
[null,520273,"川西市（下水道）"]
[null,52028,"小野市"]
[null,520280,"小野市（下水道）"]
[null,520282,"小野市（上水道）"]
[null,52029,"三田市"]
[null,520290,"三田市（病院）"]
[null,520291,"三田市（水道）"]
[null,520292,"三田市（下水道）"]
[null,52030,"加西市"]
[null,520300,"加西市（水道）"]
[null,520301,"加西市（病院）"]
[null,520302,"加西市（下水道）"]
[null,52031,"篠山市"]
[null,520310,"篠山市（上水）"]
[null,520311,"篠山市（上水出資債）"]
[null,520312,"篠山市（ガス）"]
[null,52032,"養父市"]
[null,520320,"養父市（上水道）"]
[null,52033,"丹波市"]
[null,520330,"丹波市（上水道）"]
[null,520331,"丹波市（簡易水道）"]
[null,520332,"丹波市（下水道）"]
[null,520333,"丹波市（国保）"]
[null,52034,"南あわじ市"]
[null,520340,"南あわじ市（上水道）"]
[null,520341,"南あわじ市（下水道）"]
[null,52035,"朝来市"]
[null,520350,"朝来市（上水道）"]
[null,52036,"淡路市"]
[null,520360,"淡路市（福祉の里）"]
[null,520361,"淡路市（簡易水道）"]
[null,520362,"淡路市（農業集落排水）"]
[null,520363,"淡路市（産地直売所）"]
[null,520364,"淡路市（津名港ターミナル）"]
[null,520365,"淡路市（公共下水道）"]
[null,520366,"淡路市（水道）"]
[null,52037,"宍粟市"]
[null,520370,"宍粟市（簡易水道）"]
[null,520371,"宍粟市（上水道）"]
[null,520372,"宍粟市（下水道）"]
[null,520373,"宍粟市（観光）"]
[null,520374,"宍粟市（病院）"]
[null,52038,"豊岡市"]
[null,520380,"豊岡市（国保・直診）"]
[null,520381,"豊岡市（介護保険）"]
[null,520382,"豊岡市（診療所）"]
[null,520383,"豊岡市（墓地）"]
[null,520384,"豊岡市（簡水）"]
[null,520385,"豊岡市（宅地）"]
[null,520386,"豊岡市（湯島財産区）"]
[null,520387,"豊岡市（高橋財産区）"]
[null,520388,"豊岡市（下水）"]
[null,520389,"豊岡市（水道）"]
[null,"52038A","豊岡市（農業共済）"]
[null,52039,"たつの市"]
[null,520390,"たつの市（上水道）"]
[null,520391,"たつの市（宿舎）"]
[null,520392,"たつの市（病院）"]
[null,52040,"西脇市"]
[null,520400,"西脇市（水道）"]
[null,520401,"西脇市（簡易水道）"]
[null,520402,"西脇市（病院）"]
[null,520403,"西脇市（下水道）"]
[null,52041,"洲本市"]
[null,52042,"加東市"]
[null,520420,"加東市（診療所）"]
[null,520421,"加東市（下水道）"]
[null,520422,"加東市（農集排）"]
[null,520423,"加東市（コミプラ）"]
[null,520424,"加東市（下水道・特例措置）"]
[null,520425,"加東市（辺地）"]
[null,520426,"加東市（上水道）"]
[null,520427,"加東市（病院）"]
[null,520428,"加東市（介護）"]
[null,52100,"猪名川町"]
[null,521000,"猪名川町（水道）"]
[null,52113,"多可町"]
[null,521130,"多可町（下水道）"]
[null,521131,"多可町（簡易水道）"]
[null,521132,"多可町（水道）"]
[null,52136,"稲美町"]
[null,521360,"稲美町（水道）"]
[null,52139,"播磨町"]
[null,52149,"神河町"]
[null,521490,"神河町（上水道）"]
[null,521491,"神河町（下水道）"]
[null,521492,"神河町　（病院）"]
[null,52154,"市川町"]
[null,521540,"市川町（上水道）"]
[null,52157,"福崎町"]
[null,521570,"福崎町（上水道）"]
[null,52178,"太子町"]
[null,52181,"上郡町"]
[null,521810,"上郡町（下水道）"]
[null,521811,"上郡町（水道）"]
[null,521812,"上郡町（簡易水道）"]
[null,52182,"佐用町"]
[null,521820,"佐用町（上水道）"]
[null,52230,"新温泉町"]
[null,52239,"香美町"]
[null,522390,"香美町（病院）"]
[null,522391,"香美町（上水道）"]
[null,522392,"香美町（下水道）"]
[null,52550,"阪神水道企業団"]
[null,52600,"公立豊岡病院組合"]
[null,52606,"南あわじ市・洲本市小中学校組合"]
[null,52609,"北播衛生事務組合"]
[null,52611,"揖龍保健衛生施設事務組合"]
[null,52614,"北播磨こども発達支援センター事務組合わかあゆ園"]
[null,52616,"北播磨清掃事務組合"]
[null,52617,"播磨内陸医務事業組合"]
[null,52618,"洲本市・南あわじ市衛生事務組合"]
[null,52619,"西播磨水道企業団"]
[null,52620,"淡路広域行政事務組合"]
[null,52623,"丹波少年自然の家事務組合"]
[null,52624,"安室ダム水道用水供給企業団"]
[null,52626,"淡路広域水道企業団"]
[null,52628,"小野加東環境施設事務組合"]
[null,52629,"淡路広域消防事務組合"]
[null,52630,"小野加東広域事務組合"]
[null,52632,"神崎郡市川町外四ヶ市町共有財産"]
[null,52633,"猪名川上流広域ごみ処理施設組合"]
[null,52635,"加古川市外二市共有公会堂事務組"]
[null,52636,"洲本市・南あわじ市山林事務組合"]
[null,52637,"東播磨農業共済事務組合"]
[null,52638,"西脇多可行政事務組合"]
[null,52639,"公立八鹿病院組合"]
[null,52641,"南但広域行政事務組合"]
[null,52642,"氷上多可衛生事務組合"]
[null,52645,"兵庫県佐用郡佐用町・宍粟市三土中学校事務組合"]
[null,52646,"播磨高原広域事務組合"]
[null,526460,"播磨高原広域事務組合（水道）"]
[null,526461,"播磨高原広域事務組合（下水道）"]
[null,52647,"くれさか環境事務組合"]
[null,52648,"中播衛生施設事務組合"]
[null,52649,"にしはりま環境事務組合"]
[null,52650,"北播磨総合医療センター企業団"]
[null,52725,"加古郡衛生事務組合"]
[null,52738,"美方郡広域事務組合"]
[null,52739,"神崎郡南部斎苑事務組合"]
[null,52740,"中播北部行政事務組合"]
[null,52752,"北但行政事務組合"]
[null,53000,"奈良県"]
[null,530000,"奈良県（上水道）"]
[null,530001,"奈良県（五条病院）"]
[null,530002,"奈良県（奈良病院）"]
[null,530003,"奈良県（市場）"]
[null,530004,"奈良県（三室病院）"]
[null,530005,"奈良県（医大病院）"]
[null,530006,"奈良県（下水道）"]
[null,530007,"奈良県（上水出資債）"]
[null,53010,"奈良市"]
[null,530100,"奈良市（水道）"]
[null,530101,"奈良市（上水出資債）"]
[null,530102,"奈良市（病院）"]
[null,530103,"奈良市（下水道）"]
[null,53011,"大和高田市"]
[null,530110,"大和高田市（病院）"]
[null,530111,"大和高田市（水道）"]
[null,53012,"大和郡山市"]
[null,530120,"大和郡山市（水道）"]
[null,530121,"大和郡山市（上水出資債）"]
[null,530122,"大和郡山市（下水道）"]
[null,53013,"天理市"]
[null,530130,"天理市（上水道）"]
[null,530132,"天理市（病院）"]
[null,530133,"天理市（下水道）"]
[null,53014,"橿原市"]
[null,530140,"橿原市（上水道）"]
[null,530141,"橿原市（上水出資債）"]
[null,530142,"橿原市（下水道）"]
[null,53015,"桜井市"]
[null,530150,"桜井市（上水道）"]
[null,530151,"桜井市（上水出資債）"]
[null,53016,"五條市"]
[null,530160,"五條市（上水道）"]
[null,53017,"御所市"]
[null,530170,"御所市（上水道）"]
[null,530171,"御所市（上水出資債）"]
[null,53018,"生駒市"]
[null,530180,"生駒市（上水道）"]
[null,530181,"生駒市（上水出資債）"]
[null,53019,"香芝市"]
[null,53020,"葛城市"]
[null,530200,"葛城市（上水道）"]
[null,53021,"宇陀市"]
[null,530210,"宇陀市（簡易水道）"]
[null,530211,"宇陀市（下水道）"]
[null,530212,"宇陀市（美榛苑）"]
[null,530213,"宇陀市（病院）"]
[null,530214,"宇陀市（水道）"]
[null,530215,"宇陀市（介護老人保健施設）"]
[null,53106,"山添村"]
[null,53112,"平群町"]
[null,53115,"三郷町"]
[null,531150,"三郷町（上水道）"]
[null,53118,"斑鳩町"]
[null,531180,"斑鳩町（上水道）"]
[null,53121,"安堵町"]
[null,53124,"川西町"]
[null,531240,"川西町（水道）"]
[null,531241,"川西町（下水道）"]
[null,53127,"三宅町"]
[null,53130,"田原本町"]
[null,531300,"田原本町（水道）"]
[null,53145,"曽爾村"]
[null,53148,"御杖村"]
[null,53151,"高取町"]
[null,531510,"高取町（上水道）"]
[null,53154,"明日香村"]
[null,531540,"明日香村（水道）"]
[null,53166,"上牧町"]
[null,53169,"王寺町"]
[null,53172,"広陵町"]
[null,531720,"広陵町（上水道）"]
[null,53175,"河合町"]
[null,531750,"河合町（水道）"]
[null,53178,"吉野町"]
[null,53181,"大淀町"]
[null,531810,"大淀町（水道）"]
[null,531811,"大淀町（下水道）"]
[null,53184,"下市町"]
[null,531840,"下市町（上水道）"]
[null,53187,"黒滝村"]
[null,53193,"天川村"]
[null,53196,"野迫川村"]
[null,53202,"十津川村"]
[null,53205,"下北山村"]
[null,53208,"上北山村"]
[null,53211,"川上村"]
[null,53214,"東吉野村"]
[null,53601,"奈良県葛城地区清掃事務組合"]
[null,53610,"香芝・王寺環境施設組合"]
[null,53611,"葛城広域行政事務組合"]
[null,53612,"東宇陀環境衛生組合"]
[null,53614,"宇陀衛生一部事務組合"]
[null,53615,"奈良県広域消防組合"]
[null,53700,"川西町三宅町式下中学校組合"]
[null,53702,"上下北山衛生一部事務組合"]
[null,53704,"老人福祉施設三室園組合"]
[null,53705,"王寺周辺広域休日応急診療施設組合"]
[null,53709,"吉野広域行政組合"]
[null,53710,"山辺環境衛生組合"]
[null,53712,"曽爾御杖行政一部事務組合"]
[null,53714,"国保中央病院組合"]
[null,53715,"南和広域衛生組合"]
[null,53717,"西和衛生試験センター組合"]
[null,53719,"静香苑環境施設組合"]
[null,53720,"南和広域医療企業団"]
[null,54000,"和歌山県"]
[null,540000,"和歌山県（公営企業）"]
[null,540001,"和歌山県（医療センター）"]
[null,540002,"和歌山県（工業用水）"]
[null,54010,"和歌山市"]
[null,540100,"和歌山市（上水道）"]
[null,540101,"和歌山市（上水道一般会計出資債）"]
[null,540102,"和歌山市（工業用水道）"]
[null,540103,"和歌山市（下水道）"]
[null,540104,"和歌山市（災害）"]
[null,54014,"御坊市"]
[null,540140,"御坊市（上水道）"]
[null,54016,"有田市"]
[null,540160,"有田市（漁業集落排水）"]
[null,540161,"有田市（上水道）"]
[null,540162,"有田市（病院）"]
[null,54017,"海南市"]
[null,540170,"海南市（上水道）"]
[null,540171,"海南市（病院）"]
[null,54018,"田辺市"]
[null,540180,"田辺市（上水道）"]
[null,54019,"新宮市"]
[null,540190,"新宮市（上水道）"]
[null,54020,"紀の川市"]
[null,540200,"紀の川市（国保直診）"]
[null,540201,"紀の川市（公共下水）"]
[null,540202,"紀の川市（特環下水）"]
[null,540203,"紀の川市（農業集落）"]
[null,540204,"紀の川市（簡易水道）"]
[null,540205,"紀の川市（上水道）"]
[null,540206,"紀の川市（工業用水）"]
[null,54021,"橋本市"]
[null,540210,"橋本市（上水道）"]
[null,540211,"橋本市（一般会計出資債）"]
[null,540212,"橋本市（病院）"]
[null,54022,"岩出市"]
[null,54104,"紀美野町"]
[null,541040,"紀美野町（上水道）"]
[null,541041,"紀美野町（美里簡水）"]
[null,541042,"紀美野町（集落排水）"]
[null,541043,"紀美野町（野上簡水）"]
[null,54127,"かつらぎ町"]
[null,54133,"九度山町"]
[null,54136,"高野町"]
[null,54142,"湯浅町"]
[null,54145,"広川町"]
[null,54149,"有田川町"]
[null,541490,"有田川町（上水道）"]
[null,54157,"美浜町"]
[null,54160,"日高町"]
[null,541600,"日高町（水道）"]
[null,54163,"由良町"]
[null,54167,"日高川町"]
[null,54170,"みなべ町"]
[null,54172,"印南町"]
[null,54188,"白浜町"]
[null,541880,"白浜町（上水道）"]
[null,541881,"白浜町（下水道）"]
[null,54191,"串本町"]
[null,541910,"串本町（上水道）"]
[null,541911,"串本町（簡易水道）"]
[null,541912,"串本町（国民宿舎）"]
[null,54193,"すさみ町"]
[null,54199,"上富田町"]
[null,54208,"那智勝浦町"]
[null,54220,"古座川町"]
[null,54223,"太地町"]
[null,54226,"北山村"]
[null,54602,"御坊日高老人福祉施設事務組合"]
[null,54607,"橋本伊都衛生施設組合"]
[null,54608,"伊都郡町村及び橋本市老人福祉施設事務組合"]
[null,54609,"紀南環境衛生施設事務組合"]
[null,54613,"海南海草老人福祉施設事務組合"]
[null,54615,"有田周辺広域圏事務組合"]
[null,54616,"伊都郡町村及び橋本市児童福祉施設事務組合"]
[null,54617,"公立紀南病院組合"]
[null,54618,"御坊市外五ケ町病院経営事務組合"]
[null,54619,"東牟婁郡町村新宮市老人福祉施設事務組合"]
[null,54621,"御坊広域行政事務組合"]
[null,54623,"国民健康保険野上厚生病院組合"]
[null,54626,"田辺周辺広域市町村圏組合"]
[null,54627,"新宮周辺広域市町村圏事務組合"]
[null,54628,"有田聖苑事務組合"]
[null,54629,"五色台広域施設組合"]
[null,54630,"田辺市周辺衛生施設組合"]
[null,54631,"海南海草環境衛生施設組合"]
[null,54632,"橋本周辺広域市町村圏組合"]
[null,54635,"上大中清掃施設組合"]
[null,54636,"公立那賀病院経営事務組合"]
[null,54637,"那賀衛生環境整備組合"]
[null,54638,"那賀老人福祉施設組合"]
[null,54639,"那賀消防組合"]
[null,54705,"有田衛生施設事務組合"]
[null,54707,"紀南地方老人福祉施設組合"]
[null,54713,"大辺路衛生施設組合"]
[null,54714,"那智勝浦町太地町環境衛生施設一部事務組合"]
[null,54721,"有田郡老人福祉施設事務組合"]
[null,54724,"那賀郡広域事務組合"]
[null,54728,"大辺路消防組合"]
[null,54730,"伊都消防組合"]
[null,54732,"富田川衛生施設組合"]
[null,54733,"那賀郡町村児童福祉施設組合"]
[null,54734,"串本町古座川町衛生施設事務組合"]
[null,54736,"日高広域消防事務組合"]
[null,54741,"湯浅広川消防組合"]
[null,54742,"那賀郡休日急患診療所経営事務組"]
[null,54744,"富田川治水組合"]
[null,55000,"滋賀県"]
[null,550001,"滋賀県（水道一般会計出資債）"]
[null,550002,"滋賀県（工水）"]
[null,550003,"滋賀県（上水）"]
[null,550004,"滋賀県（病院）"]
[null,55010,"大津市"]
[null,550100,"大津市（水道）"]
[null,550101,"大津市（ガス）"]
[null,550102,"大津市（病院）"]
[null,550103,"大津市（水道一般会計出資債）"]
[null,550105,"大津市（下水道）"]
[null,55011,"彦根市"]
[null,550110,"彦根市（上水道）"]
[null,550111,"彦根市（病院）"]
[null,55015,"草津市"]
[null,55016,"守山市"]
[null,550160,"守山市（上水道）"]
[null,55017,"栗東市"]
[null,550170,"栗東市（上下水道）"]
[null,55018,"甲賀市"]
[null,550180,"甲賀市（上水道出資債）"]
[null,550181,"甲賀市（土地取得）"]
[null,550182,"甲賀市（下水道）"]
[null,550183,"甲賀市（上水道）"]
[null,550184,"甲賀市（病院）"]
[null,55019,"野洲市"]
[null,550190,"野洲市（上水道）"]
[null,550191,"野洲市（下水道）"]
[null,550192,"野洲市（農業集落排水）"]
[null,55020,"湖南市"]
[null,550200,"湖南市（上水道）"]
[null,550201,"湖南市（下水道）"]
[null,550202,"湖南市（病院）"]
[null,550203,"湖南市（国保）"]
[null,55021,"高島市"]
[null,550210,"高島市（病院）"]
[null,55022,"東近江市"]
[null,550220,"東近江市（国保直診）"]
[null,550221,"東近江市（簡易水道）"]
[null,550222,"東近江市（下水道）"]
[null,550223,"東近江市（卸売市場）"]
[null,550224,"東近江市（水道）"]
[null,550225,"東近江市（病院）"]
[null,55023,"米原市"]
[null,550230,"米原市（直診）"]
[null,550231,"米原市（簡易水道）"]
[null,550232,"米原市（上水道）"]
[null,550233,"米原市（集落排水）"]
[null,550234,"米原市（流域下水）"]
[null,550235,"米原市（公共・特環）"]
[null,550236,"米原市（下水道・特例措置）"]
[null,55024,"長浜市"]
[null,550240,"長浜市（公共）"]
[null,550241,"長浜市（農排）"]
[null,550243,"長浜市（上水道）"]
[null,550244,"長浜市（簡易水道）"]
[null,550245,"長浜市（病院）"]
[null,550246,"長浜市（診療所）"]
[null,550247,"長浜市（老人保健）"]
[null,55025,"近江八幡市"]
[null,550250,"近江八幡市（上水道）"]
[null,550251,"近江八幡市（下水道）"]
[null,550252,"近江八幡市（農業集落排水）"]
[null,550253,"近江八幡市（病院）"]
[null,55142,"日野町"]
[null,55151,"竜王町"]
[null,551510,"竜王町（水道）"]
[null,55170,"愛荘町"]
[null,55178,"豊郷町"]
[null,55181,"甲良町"]
[null,55184,"多賀町"]
[null,55603,"長浜水道企業団"]
[null,55605,"湖北広域行政事務センタ－"]
[null,55607,"中部清掃組合"]
[null,55608,"東近江行政組合"]
[null,55616,"八日市布引ライフ組合"]
[null,55618,"彦根市犬上郡営林組合"]
[null,55621,"守山野洲行政事務組合"]
[null,55622,"湖南広域行政組合"]
[null,55623,"彦根愛知犬上広域行政組合"]
[null,55624,"彦根市・米原市山林組合"]
[null,55625,"大滝山林組合"]
[null,55627,"滋賀県市町村交通災害共済組合"]
[null,55629,"公立甲賀病院組合"]
[null,55630,"甲賀広域行政組合"]
[null,55634,"愛知郡広域行政組合"]
[null,55635,"湖東広域衛生管理組合"]
[null,55636,"湖北地域消防組合"]
[null,55729,"滋賀県町村職員退職手当組合"]
[null,55734,"滋賀県町村議会議員公務災害補償"]